Phosphine-d2

Gas phase ion energetics data

Data compiled by: Henry M. Rosenstock, Keith Draxl, Bruce W. Steiner, and John T. Herron

Ionization energy determinations

IE (eV) Method Reference
10.2 ± 0.2EIWada and Kiser, 1964

References

Wada and Kiser, 1964
Wada, Y.; Kiser, R.W., Mass spectrometric study of phosphine and diphosphine, Inorg. Chem., 1964, 3, 174. [all data]