Borazine,2,4,6-trifluoro-
- Formula: B3F3H3N3
- Molecular weight: 134.472
- IUPAC Standard InChIKey: YHCVICAQJSCHJR-UHFFFAOYSA-N
- CAS Registry Number: 13779-24-3
- Chemical structure:
View 3d structure (requires JavaScript / HTML 5) - Permanent link for this species. Use this link for bookmarking this species for future reference.

Phase change data

Data compiled by: William E. Acree, Jr., James S. Chickos
Enthalpy of sublimation
ΔsubH (kJ/mol) | Temperature (K) | Method | Reference |
---|---|---|---|
63.1 ± 0.1 | 273. to 454. | I | Laubengayer and Scaife, 1966 |

Gas phase ion energetics data

Data compiled as indicated in comments:
LLK - Sharon G. Lias, Rhoda D. Levin, and Sherif A. Kafafi
RDSH - Henry M. Rosenstock, Keith Draxl, Bruce W. Steiner, and John T. Herron
Ionization energy determinations
IE (eV) | Method | Reference | Comment |
---|---|---|---|
10.46 | PE | Brundle, Robin, et al., 1972 | LLK |
10.46 ± 0.01 | PE | Lloyd and Lynaugh, 1970 | RDSH |
10.66 | PE | Brundle and Jones, 1973 | Vertical value; LLK |
10.66 | PE | Bock and Fuss, 1971 | Vertical value; LLK |

References

Laubengayer and Scaife, 1966
Laubengayer, A.W.; Scaife, C.W.J.,
The Vapor Pressures and Some Thermodynamic Functions of B-Trifluoro-, B-Trichloro-, and B-Tribromoborazine.,
J. Chem. Eng. Data, 1966, 11, 2, 172-174, https://doi.org/10.1021/je60029a012
. [all data]
Brundle, Robin, et al., 1972
Brundle, C.R.; Robin, M.B.; Kuebler, N.A.,
Perfluoro effect in photoelectron spectroscopy. II. Aromatic molecules,
J. Am. Chem. Soc., 1972, 94, 1466. [all data]
Lloyd and Lynaugh, 1970
Lloyd, D.R.; Lynaugh, N.,
Photoelectron studies of boron compounds. I. Diborane, borazine and B-trifluoroborazine,
Phil. Trans. Roy. Soc. (London), 1970, A268, 97. [all data]
Brundle and Jones, 1973
Brundle, C.R.; Jones, G.R.,
The high resolution photoelectron spectra and the electronic structure of XeOF4,
J. Electron Spectrosc. Relat. Phenom., 1973, 1, 403. [all data]
Bock and Fuss, 1971
Bock, H.; Fuss, W.,
Arguments concerning the orbital sequence in borazin,
Angew. Chem. Int. Ed. Engl., 1971, 10, 182. [all data]