zirconium tetrabromide
- Formula: Br4Zr
- Molecular weight: 410.840
- CAS Registry Number: 13777-25-8

Gas phase thermochemistry data

Quantity | Value | Units | Method | Reference | Comment |
---|---|---|---|---|---|
ΔfH°gas | -154.10 | kcal/mol | Review | Chase, 1998 | Data last reviewed in June, 1975 |
Quantity | Value | Units | Method | Reference | Comment |
S°gas,1 bar | 99.063 | cal/mol*K | Review | Chase, 1998 | Data last reviewed in June, 1975 |
Gas Phase Heat Capacity (Shomate Equation)
Cp° = A + B*t + C*t2 + D*t3 +
E/t2
H° − H°298.15= A*t + B*t2/2 +
C*t3/3 + D*t4/4 − E/t + F − H
S° = A*ln(t) + B*t + C*t2/2 + D*t3/3 −
E/(2*t2) + G
Cp = heat capacity (cal/mol*K)
H° = standard enthalpy (kcal/mol)
S° = standard entropy (cal/mol*K)
t = temperature (K) / 1000.
View plot Requires a JavaScript / HTML 5 canvas capable browser.
Temperature (K) | 298. to 6000. |
---|---|
A | 25.78069 |
B | 0.045321 |
C | -0.012326 |
D | 0.001054 |
E | -0.112365 |
F | -162.1650 |
G | 129.6170 |
H | -154.1000 |
Reference | Chase, 1998 |
Comment | Data last reviewed in June, 1975 |

Condensed phase thermochemistry data

Quantity | Value | Units | Method | Reference | Comment |
---|---|---|---|---|---|
ΔfH°solid | -181.80 | kcal/mol | Review | Chase, 1998 | Data last reviewed in June, 1975 |
Quantity | Value | Units | Method | Reference | Comment |
S°solid | 53.695 | cal/mol*K | Review | Chase, 1998 | Data last reviewed in June, 1975 |
Solid Phase Heat Capacity (Shomate Equation)
Cp° = A + B*t + C*t2 + D*t3 +
E/t2
H° − H°298.15= A*t + B*t2/2 +
C*t3/3 + D*t4/4 − E/t + F − H
S° = A*ln(t) + B*t + C*t2/2 + D*t3/3 −
E/(2*t2) + G
Cp = heat capacity (cal/mol*K)
H° = standard enthalpy (kcal/mol)
S° = standard entropy (cal/mol*K)
t = temperature (K) / 1000.
View plot Requires a JavaScript / HTML 5 canvas capable browser.
Temperature (K) | 298. to 1000. |
---|---|
A | 31.47789 |
B | 1.197591 |
C | 0.413790 |
D | 0.131260 |
E | -0.181889 |
F | -191.8550 |
G | 90.38910 |
H | -181.8000 |
Reference | Chase, 1998 |
Comment | Data last reviewed in June, 1975 |

Phase change data

Antoine Equation Parameters
log10(P) = A − (B / (T + C))
P = vapor pressure (atm)
T = temperature (K)
View plot Requires a JavaScript / HTML 5 canvas capable browser.
Temperature (K) | A | B | C | Reference | Comment |
---|---|---|---|---|---|
480. to 630. | 9.03628 | 5549.895 | -15.075 | Stull, 1947 | Coefficents calculated by NIST from author's data. |

Gas phase ion energetics data

Data compiled by: Sharon G. Lias, Rhoda D. Levin, and Sherif A. Kafafi
Ionization energy determinations
IE (eV) | Method | Reference | Comment |
---|---|---|---|
10.7 | PE | Egdell and Orchard, 1978 | |
10.86 | PE | Egdell and Orchard, 1978 | Vertical value |

Vibrational and/or electronic energy levels

Data compiled by: Takehiko Shimanouchi
Symmetry: Td Symmetry Number σ = 12
Sym. | No | Approximate | Selected Freq. | Infrared | Raman | Comments | ||||
---|---|---|---|---|---|---|---|---|---|---|
Species | type of mode | Value | Rating | Value | Phase | Value | Phase | |||
a1 | 1 | Sym str | 223 | B | ia | 222.5 | gas | |||
e | 2 | Deg deform | 60 | B | ia | 60 | gas | |||
f2 | 3 | Deg str | 315 | C | 315 | gas | ||||
f2 | 4 | Deg deform | 72 | C | 72 | gas | ||||
Source: Shimanouchi, 1972

References

Chase, 1998
Chase, M.W., Jr.,
NIST-JANAF Themochemical Tables, Fourth Edition,
J. Phys. Chem. Ref. Data, Monograph 9, 1998, 1-1951. [all data]
Stull, 1947
Stull, Daniel R.,
Vapor Pressure of Pure Substances. Organic and Inorganic Compounds,
Ind. Eng. Chem., 1947, 39, 4, 517-540, https://doi.org/10.1021/ie50448a022
. [all data]
Egdell and Orchard, 1978
Egdell, R.G.; Orchard, A.F.,
Photoelectron spectra of the group IVA halides,
J. Chem. Soc. Faraday Trans. 2, 1978, 74, 485. [all data]
Shimanouchi, 1972
Shimanouchi, T.,
Tables of Molecular Vibrational Frequencies Consolidated Volume II,
J. Phys. Chem. Ref. Data, 1972, 6, 3, 993-1102. [all data]