Nitrogen fluoride, (E)-
- Formula: F2N2
- Molecular weight: 66.0102
- IUPAC Standard InChIKey: DUQAODNTUBJRGF-ONEGZZNKSA-N
- CAS Registry Number: 13776-62-0
- Chemical structure:
View 3d structure (requires JavaScript / HTML 5) - Stereoisomers:
- Other names: (E)-Difluorodiazene; trans-Difluorodiazene; trans-1,2-Difluorodiazene; trans-1,2-Difluorodiimide; (E)-N2F2; Nitrogen fluoride, trans; FNNF; Nitrogen fluoride (N2F2), (E)-; Difluorodiazene, (E)-; Dinitrogen difluoride, (E)-

Gas phase thermochemistry data

Quantity | Value | Units | Method | Reference | Comment |
---|---|---|---|---|---|
ΔfH°gas | 81.17 | kJ/mol | Review | Chase, 1998 | Data last reviewed in December, 1965 |
Quantity | Value | Units | Method | Reference | Comment |
S°gas,1 bar | 262.63 | J/mol*K | Review | Chase, 1998 | Data last reviewed in December, 1965 |
Gas Phase Heat Capacity (Shomate Equation)
Cp° = A + B*t + C*t2 + D*t3 +
E/t2
H° − H°298.15= A*t + B*t2/2 +
C*t3/3 + D*t4/4 − E/t + F − H
S° = A*ln(t) + B*t + C*t2/2 + D*t3/3 −
E/(2*t2) + G
Cp = heat capacity (J/mol*K)
H° = standard enthalpy (kJ/mol)
S° = standard entropy (J/mol*K)
t = temperature (K) / 1000.
View plot Requires a JavaScript / HTML 5 canvas capable browser.
Temperature (K) | 298. to 2000. | 2000. to 6000. |
---|---|---|
A | 46.22550 | 82.84290 |
B | 59.00810 | 0.127562 |
C | -34.94370 | -0.020538 |
D | 7.155430 | 0.001178 |
E | -0.675464 | -6.854321 |
F | 62.78480 | 39.72470 |
G | 298.6650 | 339.5120 |
H | 81.16960 | 81.16960 |
Reference | Chase, 1998 | Chase, 1998 |
Comment | Data last reviewed in December, 1965 | Data last reviewed in December, 1965 |

Phase change data

Data compiled by: Thermodynamics Research Center, NIST Boulder Laboratories, Chris Muzny director
Quantity | Value | Units | Method | Reference | Comment |
---|---|---|---|---|---|
Tboil | 161.8 | K | N/A | Colburn, Johnson, et al., 1959 | Uncertainty assigned by TRC = 0.7 K |
Quantity | Value | Units | Method | Reference | Comment |
Tfus | 101. | K | N/A | Colburn, Johnson, et al., 1959 | Uncertainty assigned by TRC = 2. K |
Quantity | Value | Units | Method | Reference | Comment |
Tc | 260. | K | N/A | Colburn, Johnson, et al., 1959 | Uncertainty assigned by TRC = 3. K |

Gas phase ion energetics data

Data evaluated as indicated in comments:
L - Sharon G. Lias
Data compiled as indicated in comments:
LLK - Sharon G. Lias, Rhoda D. Levin, and Sherif A. Kafafi
RDSH - Henry M. Rosenstock, Keith Draxl, Bruce W. Steiner, and John T. Herron
Quantity | Value | Units | Method | Reference | Comment |
---|---|---|---|---|---|
IE (evaluated) | 12.8 | eV | N/A | N/A | L |
Ionization energy determinations
IE (eV) | Method | Reference | Comment |
---|---|---|---|
12.8 | PE | Brundle, Robin, et al., 1972 | LLK |
13.1 ± 0.1 | EI | Herron and Dibeler, 1961 | RDSH |
Appearance energy determinations
Ion | AE (eV) | Other Products | Method | Reference | Comment |
---|---|---|---|---|---|
NF+ | 17.0 ± 0.2 | NF | EI | Herron and Dibeler, 1961 | RDSH |
N2F+ | 13.9 ± 0.2 | F | EI | Herron and Dibeler, 1961 | RDSH |

References

Chase, 1998
Chase, M.W., Jr.,
NIST-JANAF Themochemical Tables, Fourth Edition,
J. Phys. Chem. Ref. Data, Monograph 9, 1998, 1-1951. [all data]
Colburn, Johnson, et al., 1959
Colburn, C.B.; Johnson, F.A.; Kennedy, A.; McCallum, K.; Metzger, L.C.; Parker, C.O.,
Difluorodiazene,
J. Am. Chem. Soc., 1959, 81, 6397. [all data]
Brundle, Robin, et al., 1972
Brundle, C.R.; Robin, M.B.; Kuebler, N.A.; Basch, H.,
Perfluoro effect in photoelectron spectroscopy. I. Nonaromatic molecules,
J. Am. Chem. Soc., 1972, 94, 1451. [all data]
Herron and Dibeler, 1961
Herron, J.T.; Dibeler, V.H.,
Mass spectrometric study of NF2, NF3, N2F2, and N2F4,
J. Res. NBS, 1961, 65A, 405. [all data]