Dibromosilane
- Formula: Br2H2Si
- Molecular weight: 189.909
- IUPAC Standard InChIKey: VJIYRPVGAZXYBD-UHFFFAOYSA-N
- CAS Registry Number: 13768-94-0
- Chemical structure:
View 3d structure (requires JavaScript / HTML 5) - Permanent link for this species. Use this link for bookmarking this species for future reference.

Gas phase thermochemistry data

Quantity | Value | Units | Method | Reference | Comment |
---|---|---|---|---|---|
ΔfH°gas | -190.37 | kJ/mol | Review | Chase, 1998 | Data last reviewed in December, 1976 |
Quantity | Value | Units | Method | Reference | Comment |
S°gas,1 bar | 310.04 | J/mol*K | Review | Chase, 1998 | Data last reviewed in December, 1976 |
Gas Phase Heat Capacity (Shomate Equation)
Cp° = A + B*t + C*t2 + D*t3 +
E/t2
H° − H°298.15= A*t + B*t2/2 +
C*t3/3 + D*t4/4 − E/t + F − H
S° = A*ln(t) + B*t + C*t2/2 + D*t3/3 −
E/(2*t2) + G
Cp = heat capacity (J/mol*K)
H° = standard enthalpy (kJ/mol)
S° = standard entropy (J/mol*K)
t = temperature (K) / 1000.
View plot Requires a JavaScript / HTML 5 canvas capable browser.
Temperature (K) | 298. to 1400. | 1400. to 6000. |
---|---|---|
A | 54.34765 | 104.3879 |
B | 76.57640 | 1.857551 |
C | -44.82068 | -0.345831 |
D | 9.887462 | 0.022433 |
E | -0.705314 | -11.65658 |
F | -211.9706 | -247.8305 |
G | 350.9204 | 401.3339 |
H | -190.3720 | -190.3720 |
Reference | Chase, 1998 | Chase, 1998 |
Comment | Data last reviewed in December, 1976 | Data last reviewed in December, 1976 |

Phase change data

Antoine Equation Parameters
log10(P) = A − (B / (T + C))
P = vapor pressure (bar)
T = temperature (K)
View plot Requires a JavaScript / HTML 5 canvas capable browser.
Temperature (K) | A | B | C | Reference | Comment |
---|---|---|---|---|---|
212.3 to 343.7 | 4.11547 | 1312.752 | -24.478 | Stull, 1947 | Coefficents calculated by NIST from author's data. |

Gas phase ion energetics data

Data compiled as indicated in comments:
LLK - Sharon G. Lias, Rhoda D. Levin, and Sherif A. Kafafi
Ionization energy determinations
IE (eV) | Method | Reference | Comment |
---|---|---|---|
10.7 | PE | Cradock and Whiteford, 1971 | LLK |
10.92 ± 0.02 | PE | Cradock and Whiteford, 1971 | Vertical value; LLK |

Vibrational and/or electronic energy levels

Data compiled by: Takehiko Shimanouchi
Symmetry: C2ν Symmetry Number σ = 2
Sym. | No | Approximate | Selected Freq. | Infrared | Raman | Comments | ||||
---|---|---|---|---|---|---|---|---|---|---|
Species | type of mode | Value | Rating | Value | Phase | Value | Phase | |||
a1 | 1 | SiH2 s-str | 2206 | D | 2200 S | gas | 2206 S p | liq. | ||
a1 | 2 | SiH2 scis | 942 | C | 942 VS | gas | 925 W dp | liq. | ||
a1 | 3 | SiBr2 s-str | 407 | C | 407 M | gas | 393 S p | liq. | ||
a1 | 4 | SiBr2 scis | 122 | D | 122 M p | liq. | ||||
a2 | 5 | SiH2 twist | 688 | D | ia | 688 W dp | liq. | |||
b1 | 6 | SiH2 a-str | 2232 | D | 2200 S | gas | 2232 W dp | liq. | ||
b1 | 7 | SiH2 rock | 556 | C | 556 S | gas | ||||
b2 | 8 | SiH2 wag | 843 | C | 843 VS | gas | 828 VW dp | liq. | ||
b2 | 9 | SiBr2 a-str | 471 | C | 471 S | gas | 456 W dp | liq. | ||
Source: Shimanouchi, 1972

References

Chase, 1998
Chase, M.W., Jr.,
NIST-JANAF Themochemical Tables, Fourth Edition,
J. Phys. Chem. Ref. Data, Monograph 9, 1998, 1-1951. [all data]
Stull, 1947
Stull, Daniel R.,
Vapor Pressure of Pure Substances. Organic and Inorganic Compounds,
Ind. Eng. Chem., 1947, 39, 4, 517-540, https://doi.org/10.1021/ie50448a022
. [all data]
Cradock and Whiteford, 1971
Cradock, S.; Whiteford, R.A.,
Photo-electron spectra of the mono and dihalo silanes and germanes,
J. Chem. Soc. Faraday Trans., 1971, 67, 3425. [all data]
Shimanouchi, 1972
Shimanouchi, T.,
Tables of Molecular Vibrational Frequencies Consolidated Volume II,
J. Phys. Chem. Ref. Data, 1972, 6, 3, 993-1102. [all data]