selenium trioxide
- Formula: O3Se
- Molecular weight: 126.96
- IUPAC Standard InChIKey: VFLXBUJKRRJAKY-UHFFFAOYSA-N
- CAS Registry Number: 13768-86-0
- Chemical structure:
View 3d structure (requires JavaScript / HTML 5) - Permanent link for this species. Use this link for bookmarking this species for future reference.

Gas phase ion energetics data

Data compiled by: Henry M. Rosenstock, Keith Draxl, Bruce W. Steiner, and John T. Herron
Ionization energy determinations
IE (eV) | Method | Reference |
---|---|---|
11.6 ± 0.5 | EI | Ficalora, Thompson, et al., 1969 |
Appearance energy determinations
Ion | AE (eV) | Other Products | Method | Reference | Comment |
---|---|---|---|---|---|
SeO+ | 14.8 ± 0.5 | ? | EI | Ficalora, Thompson, et al., 1969 | |
SeO2+ | 13.8 ± 0.5 | O | EI | Ficalora, Thompson, et al., 1969 | |
Se+ | 18.3 ± 0.5 | ? | EI | Ficalora, Thompson, et al., 1969 |

References

Ficalora, Thompson, et al., 1969
Ficalora, P.J.; Thompson, J.C.; Margrave, J.L.,
Mass spectrometric studies at high temperatures-XXVI.The sublimation of SeO, and SeO3,
J. Inorg. Nucl. Chem., 1969, 31, 3771. [all data]