Borane(1)
- Formula: BH
- Molecular weight: 11.819
- IUPAC Standard InChIKey: UWBOAQKPEXKXSU-UHFFFAOYSA-N
- CAS Registry Number: 13766-26-2
- Chemical structure:
View 3d structure (requires JavaScript / HTML 5) - Permanent link for this species. Use this link for bookmarking this species for future reference.

Gas phase ion energetics data

Data evaluated as indicated in comments:
L - Sharon G. Lias
Data compiled as indicated in comments:
B - John E. Bartmess
LLK - Sharon G. Lias, Rhoda D. Levin, and Sherif A. Kafafi
RDSH - Henry M. Rosenstock, Keith Draxl, Bruce W. Steiner, and John T. Herron
Quantity | Value | Units | Method | Reference | Comment |
---|---|---|---|---|---|
IE (evaluated) | 9.77 ± 0.05 | eV | N/A | N/A | L |
Electron affinity determinations
EA (eV) | Reference | Comment |
---|---|---|
0.30 ± 0.25 | Reid, 1993 | B |
Ionization energy determinations
IE (eV) | Method | Reference | Comment |
---|---|---|---|
9.77 | EVAL | Huber and Herzberg, 1979 | LLK |
9.8 ± 0.5 | EI | Steck, Pressley, et al., 1969 | RDSH |
9.77 ± 0.05 | S | Bauer, Herzberg, et al., 1964 | RDSH |
De-protonation reactions
B- + =
Quantity | Value | Units | Method | Reference | Comment |
---|---|---|---|---|---|
ΔrH° | 1622. ± 8.8 | kJ/mol | D-EA | Scheer, Bilodeau, et al., 1998 | gas phase; tunable IR laser; B |
Quantity | Value | Units | Method | Reference | Comment |
ΔrG° | 1594. ± 9.2 | kJ/mol | H-TS | Scheer, Bilodeau, et al., 1998 | gas phase; tunable IR laser; B |

Gas phase thermochemistry data

Quantity | Value | Units | Method | Reference | Comment |
---|---|---|---|---|---|
ΔfH°gas | 442.67 | kJ/mol | Review | Chase, 1998 | Data last reviewed in December, 1964 |
Quantity | Value | Units | Method | Reference | Comment |
S°gas,1 bar | 171.85 | J/mol*K | Review | Chase, 1998 | Data last reviewed in December, 1964 |
Gas Phase Heat Capacity (Shomate Equation)
Cp° = A + B*t + C*t2 + D*t3 +
E/t2
H° − H°298.15= A*t + B*t2/2 +
C*t3/3 + D*t4/4 − E/t + F − H
S° = A*ln(t) + B*t + C*t2/2 + D*t3/3 −
E/(2*t2) + G
Cp = heat capacity (J/mol*K)
H° = standard enthalpy (kJ/mol)
S° = standard entropy (J/mol*K)
t = temperature (K) / 1000.
View plot Requires a JavaScript / HTML 5 canvas capable browser.
Temperature (K) | 298. to 1000. | 1000. to 6000. |
---|---|---|
A | 30.91997 | 33.59007 |
B | -12.54882 | 2.726701 |
C | 26.09904 | -0.432931 |
D | -11.31437 | 0.030087 |
E | -0.001311 | -2.825594 |
F | 433.7929 | 426.6634 |
G | 211.9422 | 204.7336 |
H | 442.6672 | 442.6672 |
Reference | Chase, 1998 | Chase, 1998 |
Comment | Data last reviewed in December, 1964 | Data last reviewed in December, 1964 |

Reaction thermochemistry data

Data compiled by: John E. Bartmess
Individual Reactions
B- + =
Quantity | Value | Units | Method | Reference | Comment |
---|---|---|---|---|---|
ΔrH° | 1622. ± 8.8 | kJ/mol | D-EA | Scheer, Bilodeau, et al., 1998 | gas phase; tunable IR laser |
Quantity | Value | Units | Method | Reference | Comment |
ΔrG° | 1594. ± 9.2 | kJ/mol | H-TS | Scheer, Bilodeau, et al., 1998 | gas phase; tunable IR laser |

Constants of diatomic molecules

Data compiled by: Klaus P. Huber and Gerhard H. Herzberg
Data collected through April, 1976
Symbol | Meaning |
---|---|
State | electronic state and / or symmetry symbol |
Te | minimum electronic energy (cm-1) |
ωe | vibrational constant – first term (cm-1) |
ωexe | vibrational constant – second term (cm-1) |
ωeye | vibrational constant – third term (cm-1) |
Be | rotational constant in equilibrium position (cm-1) |
αe | rotational constant – first term (cm-1) |
γe | rotation-vibration interaction constant (cm-1) |
De | centrifugal distortion constant (cm-1) |
βe | rotational constant – first term, centrifugal force (cm-1) |
re | internuclear distance (Å) |
Trans. | observed transition(s) corresponding to electronic state |
ν00 | position of 0-0 band (units noted in table) |
State | Te | ωe | ωexe | ωeye | Be | αe | γe | De | βe | re | Trans. | ν00 |
---|---|---|---|---|---|---|---|---|---|---|---|---|
(5d) 1 | 5d ← X | |||||||||||
↳Bauer, Herzberg, et al., 1964 | ||||||||||||
K 1Π (4d) 2 | K ← X | 71840 | ||||||||||
↳Bauer, Herzberg, et al., 1964 | ||||||||||||
J 1Σ+ 4p 2 | J ← X 3 | 70040 | ||||||||||
↳Bauer, Herzberg, et al., 1964 | ||||||||||||
I 1Σ+ 4s | [11.99] 4 | [1.234] | I ← X 3 | 67395.8 Z | ||||||||
↳Bauer, Herzberg, et al., 1964; Johns and Lepard, 1975 | ||||||||||||
State | Te | ωe | ωexe | ωeye | Be | αe | γe | De | βe | re | Trans. | ν00 |
H 1Δ 3d | [12.255] 4 | [1.2206] | H ← A | 43345.7 Z | ||||||||
↳missing citation; Johns and Lepard, 1975 | ||||||||||||
[12.255] 4 | [1.2206] | H ← X | 66419.7 Z | |||||||||
↳missing citation; Johns and Lepard, 1975 | ||||||||||||
G 1Π 3d | [12.255] 4 | [1.2206] | G ← X | 66399.3 Z | ||||||||
↳missing citation; Johns and Lepard, 1975 | ||||||||||||
F 1Σ+ 3d | [12.255] 4 | [1.2206] | F ← X | 66079.5 Z | ||||||||
↳missing citation; Johns and Lepard, 1975 | ||||||||||||
State | Te | ωe | ωexe | ωeye | Be | αe | γe | De | βe | re | Trans. | ν00 |
E 1Σ+ 3p | [12.321] | [0.0013] | [1.2173] | E ← X | 61872.3 Z | |||||||
↳missing citation | ||||||||||||
D 1Π 3p | [12.321] | [0.0013] | [1.2173] | D ← X | 61105.4 Z | |||||||
↳missing citation | ||||||||||||
C 1Σ+ | 55281.1 | 2474.72 Z | 54.424 5 | 0.228 | 12.410 6 | 0.432 | [0.001247] 7 | 1.2129 | C → A V | 32259.78 Z | ||
↳Douglas, 1941; Johns, Grimm, et al., 1967 | ||||||||||||
C ← X 3 | 55333.69 Z | |||||||||||
↳Bauer, Herzberg, et al., 1964 | ||||||||||||
State | Te | ωe | ωexe | ωeye | Be | αe | γe | De | βe | re | Trans. | ν00 |
B 1Σ+ 3s | 52335.8 | 2.3399.91 Z | 69.519 8 | -3.927 | 12.399 9 | 0.485 10 | -0.424 | 0.00126 11 | 0.0001 | 1.2164 | B → A V | 29272.73 Z |
↳Douglas, 1941 | ||||||||||||
B ← X 3 | 52346.69 Z | |||||||||||
↳missing citation; Johns, Grimm, et al., 1967 | ||||||||||||
c 3Σ+ | 12 | |||||||||||
C' 1Δ | 45981.0 | 2610.02 Z | 46.62 | 12.757 | 0.390 | 0.001219 13 | -0.00002 | 1.1963 | C' ↔ A V | 23029.21 Z | ||
↳missing citation | ||||||||||||
State | Te | ωe | ωexe | ωeye | Be | αe | γe | De | βe | re | Trans. | ν00 |
b 3Σ(-) | [12.126] | [0.00128] | [1.2271] | b → a R | 27060.8 Z | |||||||
↳Lochte-Holtgreven and van der Vleugel, 1931; Almy and Horsfall, 1937 | ||||||||||||
A 1Π | 23135.8 | 2250.99 Z | 56.665 14 | -15.83 | 12.2952 15 16 17 | 0.8346 18 | [0.001451] 7 | 1.2186 | A 19 ↔ X RV | 23073.96 Z | ||
↳missing citation; Almy and Horsfall, 1937; Thrush, 1960; missing citation | ||||||||||||
a 3Π | 20 | [12.667] 21 | [0.00122] | [1.2006] | ||||||||
X 1Σ+ | 0 | 2366.90 Z | 49.395 22 | 0.364 | 12.021 23 | 0.412 | 0.001242 24 | -0.000026 | 1.2324 25 |

References

Reid, 1993
Reid, C.J.,
Electron Affinities of BH, B2, BC, and BN molecules determined using Charge Inversion Spectrometry,
Int. J. Mass Spectrom. Ion Proc., 1993, 127, 147, https://doi.org/10.1016/0168-1176(93)87087-9
. [all data]
Huber and Herzberg, 1979
Huber, K.P.; Herzberg, G.,
Molecular Spectra and Molecular Structure. IV. Constants of Diatomic Molecules,, Van Nostrand Reinhold Co., 1979, ,1. [all data]
Steck, Pressley, et al., 1969
Steck, S.J.; Pressley, G.A., Jr.; Stafford, F.E.,
Mass spectrometric investigation of the high-temperature reaction of hydrogen with boron carbide,
J. Phys. Chem., 1969, 73, 1000. [all data]
Bauer, Herzberg, et al., 1964
Bauer, S.H.; Herzberg, G.; Johns, J.W.C.,
The absorption spectrum of BH and BD in the vacuum ultraviolet,
J. Mol. Spectry., 1964, 13, 256. [all data]
Scheer, Bilodeau, et al., 1998
Scheer, M.; Bilodeau, R.C.; Haugen, H.K.,
Negative ion of boron: An experimental study of the P-3 ground state,
Phys. Rev. Lett., 1998, 80, 12, 2562-2565, https://doi.org/10.1103/PhysRevLett.80.2562
. [all data]