gadolinium trifluoride
- Formula: F3Gd
- Molecular weight: 214.25
- CAS Registry Number: 13765-26-9

Gas phase ion energetics data

Data compiled by: Henry M. Rosenstock, Keith Draxl, Bruce W. Steiner, and John T. Herron
Appearance energy determinations
Ion | AE (eV) | Other Products | Method | Reference | Comment |
---|---|---|---|---|---|
GdF+ | 20.0 ± 0.7 | ? | EI | Zmbov and Margrave, 1968 | |
GdF2+ | 14.5 ± 0.7 | F | EI | Zmbov and Margrave, 1968 | |
GdF2+ | 12.2 ± 0.5 | F | EI | Zmbov and Margrave, 1967 | |
Gd+ | 26.5 ± 0.7 | ? | EI | Zmbov and Margrave, 1968 |

References

Zmbov and Margrave, 1968
Zmbov, K.F.; Margrave, J.L.,
Mass spectrometric studies of scandium, yttrium, lanthanum, and rare-earth fluorides,
Advan. Chem. Ser., 1968, 72, 267. [all data]
Zmbov and Margrave, 1967
Zmbov, K.F.; Margrave, J.L.,
Mass spectrometric studies at high temperatures. XIII.Stabilities of samarium, europium and gadolinium mono- and difluorides,
J. Inorg. Nucl. Chem., 1967, 29, 59. [all data]