Phosphenodithioic fluoride
- Formula: FPS2
- Molecular weight: 114.102
- IUPAC Standard InChIKey: FBNZOXPYNXUHGG-UHFFFAOYSA-N
- CAS Registry Number: 137649-46-8
- Chemical structure:
View 3d structure (requires JavaScript / HTML 5) - Permanent link for this species. Use this link for bookmarking this species for future reference.

Gas phase ion energetics data

Data compiled by: Sharon G. Lias and Joel F. Liebman
Ionization energy determinations
IE (eV) | Method | Reference | Comment |
---|---|---|---|
10.11 | PE | Bock, Kremer, et al., 1992 | Vertical value |
10.11 | PE | Bock, Kremer, et al., 1992, 2 | Vertical value |

References

Bock, Kremer, et al., 1992
Bock, H.; Kremer, M.; Solouki, B.; Binnewies, M.; Meisel, M.,
Gas phase reactions. FPS2 and FPS,
J. Chem. Soc., Chem. Commun., 1992, 1992, 9. [all data]
Bock, Kremer, et al., 1992, 2
Bock, H.; Kremer, M.; Solouki, B.; Binnewies, M.,
Darstellung und Photoelektronen-Spektrum von Ethyldithioxo-5-phosphoran H5C2-P(=S)2,
Chem. Ber., 1992, 125, 315. [all data]