Cyclopentane, bromo-
- Formula: C5H9Br
- Molecular weight: 149.029
- IUPAC Standard InChIKey: BRTFVKHPEHKBQF-UHFFFAOYSA-N
- CAS Registry Number: 137-43-9
- Chemical structure:
View 3d structure (requires JavaScript / HTML 5) - Other names: Bromocyclopentane; Cyclopentyl bromide

Gas phase thermochemistry data

Data compiled by: Hussein Y. Afeefy, Joel F. Liebman, and Stephen E. Stein
Quantity | Value | Units | Method | Reference | Comment |
---|---|---|---|---|---|
ΔfH°gas | 9.83 | kJ/mol | Kin | Reddy and Rao, 1988 |

Phase change data

Data compiled by: Robert L. Brown and Stephen E. Stein
Quantity | Value | Units | Method | Reference | Comment |
---|---|---|---|---|---|
Tboil | 410.7 | K | N/A | Weast and Grasselli, 1989 |

Gas phase ion energetics data

Data compiled by: Sharon G. Lias, Rhoda D. Levin, and Sherif A. Kafafi
Ionization energy determinations
IE (eV) | Method | Reference |
---|---|---|
9.94 ± 0.02 | PE | Botter, Menes, et al., 1973 |

Normal alkane RI, non-polar column, custom temperature program

Column type | Active phase | I | Reference | Comment |
---|---|---|---|---|
Capillary | Methyl Silicone | 905. | N/A | Program: not specified |

References

Reddy and Rao, 1988
Reddy, T.S.; Rao, N.P.,
Ultrasonic dispersion studies in cyclopentylbromide,
Acoust. Lett., 1988, 12, 84-87. [all data]
Weast and Grasselli, 1989
CRC Handbook of Data on Organic Compounds, 2nd Editon, Weast,R.C and Grasselli, J.G., ed(s)., CRC Press, Inc., Boca Raton, FL, 1989, 1. [all data]
Botter, Menes, et al., 1973
Botter, R.; Menes, F.; Gounelle, Y.; Pechine, J.M.; Solgadi, D.,
The ionization potentials of geometrical isomers: the cis and trans 2-subststituted cyclopentyl and cyclohexyl bromides,
Int. J. Mass Spectrom. Ion Phys., 1973, 12, 188. [all data]