Silane, isocyanato-
- Formula: CH3NOSi
- Molecular weight: 73.1261
- IUPAC Standard InChIKey: BUZRAOJSFRKWPD-UHFFFAOYSA-N
- CAS Registry Number: 13730-13-7
- Chemical structure:
View 3d structure (requires JavaScript / HTML 5) - Permanent link for this species. Use this link for bookmarking this species for future reference.

Gas phase ion energetics data

Data compiled by: Sharon G. Lias, Rhoda D. Levin, and Sherif A. Kafafi
Ionization energy determinations
IE (eV) | Method | Reference | Comment |
---|---|---|---|
11.10 ± 0.02 | PE | Cradock, Ebsworth, et al., 1972 | Vertical value |

References

Cradock, Ebsworth, et al., 1972
Cradock, S.; Ebsworth, E.A.V.; Savage, W.J.; Whiteford, R.A.,
Photoelectron spectra of some methyl, silyl and germyl amines, phosphines and arsines,
J. Chem. Soc. Faraday Trans. 2, 1972, 68, 934. [all data]