1-Hexen-3-yne
- Formula: C6H8
- Molecular weight: 80.1277
- IUPAC Standard InChIKey: BYSRUWKGUGERFI-UHFFFAOYSA-N
- CAS Registry Number: 13721-54-5
- Chemical structure:
View 3d structure (requires JavaScript / HTML 5) - Other names: Ethylvinylacetylene; Vinylethylacetylene; C2H5C≡CCH=CH2; 1-Hexene-3-yne

Phase change data

Data compiled as indicated in comments:
BS - Robert L. Brown and Stephen E. Stein
TRC - Thermodynamics Research Center, NIST Boulder Laboratories, Chris Muzny director
Quantity | Value | Units | Method | Reference | Comment |
---|---|---|---|---|---|
Tboil | 358.2 | K | N/A | Weast and Grasselli, 1989 | BS |
Tboil | 356.9 | K | N/A | Petrov, Kolesova, et al., 1957 | Uncertainty assigned by TRC = 1. K; TRC |
Tboil | 356.65 | K | N/A | Hennion, Price, et al., 1954 | Uncertainty assigned by TRC = 1.5 K; TRC |

Gas phase ion energetics data

Data compiled as indicated in comments:
LLK - Sharon G. Lias, Rhoda D. Levin, and Sherif A. Kafafi
Ionization energy determinations
IE (eV) | Method | Reference | Comment |
---|---|---|---|
8.91 ± 0.01 | PE | Carlier, Mouvier, et al., 1979 | LLK |

References

Weast and Grasselli, 1989
CRC Handbook of Data on Organic Compounds, 2nd Editon, Weast,R.C and Grasselli, J.G., ed(s)., CRC Press, Inc., Boca Raton, FL, 1989, 1. [all data]
Petrov, Kolesova, et al., 1957
Petrov, A.A.; Kolesova, V.A.; Porfir'eva, Y.I.,
Conjugated Systems. LXXVIII Raman Spectra and Reactivity of Vinylacetylenic Hydrocarbons,
Zh. Obshch. Khim., 1957, 27, 2081-7. [all data]
Hennion, Price, et al., 1954
Hennion, G.F.; Price, C.C.; McKeon, T.F., Jr.,
The Preparation of Vinylacetylene,
J. Am. Chem. Soc., 1954, 76, 5160. [all data]
Carlier, Mouvier, et al., 1979
Carlier, P.; Mouvier, G.; Mesnard, D.; Miginiac, L.,
Etude par spectrometrie de photoelectrons de la structure electronique des phenyl-alcynes conjugues,
J. Electron Spectrosc. Relat. Phenom., 1979, 16, 147. [all data]