Anthracene,9-(1,1-dimethylethyl)-
- Formula: C18H18
- Molecular weight: 234.3355
- IUPAC Standard InChIKey: GWJJSVKKSBCHJD-UHFFFAOYSA-N
- CAS Registry Number: 13719-97-6
- Chemical structure:
View 3d structure (requires JavaScript / HTML 5) - Other names: 9-t-Butylanthracene

Reaction thermochemistry data

Data compiled by: Hussein Y. Afeefy, Joel F. Liebman, and Stephen E. Stein
Individual Reactions
By formula: C18H18 = C18H18
Quantity | Value | Units | Method | Reference | Comment |
---|---|---|---|---|---|
ΔrH° | -172.3 ± 5.7 | kJ/mol | Eqk | Dreeskamp, Kapahnke, et al., 1988 | liquid phase; solvent: Decalin; Isomerization |
ΔrH° | 150. ± 8. | kJ/mol | Ciso | Kraljic, Mintas, et al., 1983 | liquid phase; solvent: Hexane |
By formula: C18H18 = C18H18
Quantity | Value | Units | Method | Reference | Comment |
---|---|---|---|---|---|
ΔrH° | -172.3 ± 5.7 | kJ/mol | Ciso | Jahn and Dreeskamp, 1982 | liquid phase; solvent: Decalin |

Gas phase ion energetics data

Data compiled as indicated in comments:
LBLHLM - Sharon G. Lias, John E. Bartmess, Joel F. Liebman, John L. Holmes, Rhoda D. Levin, and W. Gary Mallard
LLK - Sharon G. Lias, Rhoda D. Levin, and Sherif A. Kafafi
Ionization energy determinations
IE (eV) | Method | Reference | Comment |
---|---|---|---|
7.13 | PE | Klasinc, Kovac, et al., 1983 | LBLHLM |
7.13 | PE | Klasinc, Kovac, et al., 1978 | LLK |
7.13 ± 0.03 | PE | Klasinc, Kovac, et al., 1983 | Vertical value; LBLHLM |
7.13 ± 0.03 | PE | Klasinc, Kovac, et al., 1978 | Vertical value; LLK |

References

Dreeskamp, Kapahnke, et al., 1988
Dreeskamp, H.; Kapahnke, P.; Tochtermann, W.,
Photo valence isomerization of sterically strained aromatic hydrocarbons: 8,9-dicarbethoxy[6]paracyclophane,
Radiat. Phys. Chem., 1988, 32, 537-539. [all data]
Kraljic, Mintas, et al., 1983
Kraljic, I.; Mintas, M.; Klasinc, L.; Ranogajec, F.; Guesten, H.,
Thermo- and photochemical aspects of the valence isomerization of 9-tert-butylanthracene,
Nouv. J. Chim., 1983, 7, 239-243. [all data]
Jahn and Dreeskamp, 1982
Jahn, B.; Dreeskamp, H.,
Valence isomerization of the 9,10-Dewar isomer to 9-tert-butylanthracene,
Z. Naturforsch. A, 1982, 37, 376-379. [all data]
Klasinc, Kovac, et al., 1983
Klasinc, L.; Kovac, B.; Gusten, H.,
Photoelectron spectra of acenes. Electronic structure and substituent effects,
Pure Appl. Chem., 1983, 55, 289. [all data]
Klasinc, Kovac, et al., 1978
Klasinc, L.; Kovac, B.; Schoof, S.; Gusten, H.,
Photoelectron spectroscopy of 9-substituted anthracenes,
Croat. Chem. Acta., 1978, 51, 307. [all data]