barium iodide
- Formula: BaI2
- Molecular weight: 391.136
- CAS Registry Number: 13718-50-8

Condensed phase thermochemistry data

Quantity | Value | Units | Method | Reference | Comment |
---|---|---|---|---|---|
ΔfH°liquid | -585.88 | kJ/mol | Review | Chase, 1998 | Data last reviewed in June, 1974 |
Quantity | Value | Units | Method | Reference | Comment |
S°liquid,1 bar | 183.67 | J/mol*K | Review | Chase, 1998 | Data last reviewed in June, 1974 |
Quantity | Value | Units | Method | Reference | Comment |
ΔfH°solid | -605.42 | kJ/mol | Review | Chase, 1998 | Data last reviewed in June, 1974 |
Quantity | Value | Units | Method | Reference | Comment |
S°solid | 165.14 | J/mol*K | Review | Chase, 1998 | Data last reviewed in June, 1974 |
Liquid Phase Heat Capacity (Shomate Equation)
Cp° = A + B*t + C*t2 + D*t3 +
E/t2
H° − H°298.15= A*t + B*t2/2 +
C*t3/3 + D*t4/4 − E/t + F − H
S° = A*ln(t) + B*t + C*t2/2 + D*t3/3 −
E/(2*t2) + G
Cp = heat capacity (J/mol*K)
H° = standard enthalpy (kJ/mol)
S° = standard entropy (J/mol*K)
t = temperature (K) / 1000.
View plot Requires a JavaScript / HTML 5 canvas capable browser.
Temperature (K) | 984. to 2800. |
---|---|
A | 112.9680 |
B | 0.000003 |
C | 5.387980×10-7 |
D | -3.171791×10-7 |
E | 0.000004 |
F | -632.2060 |
G | 293.0510 |
H | -585.8840 |
Reference | Chase, 1998 |
Comment | Data last reviewed in June, 1974 |
Solid Phase Heat Capacity (Shomate Equation)
Cp° = A + B*t + C*t2 + D*t3 +
E/t2
H° − H°298.15= A*t + B*t2/2 +
C*t3/3 + D*t4/4 − E/t + F − H
S° = A*ln(t) + B*t + C*t2/2 + D*t3/3 −
E/(2*t2) + G
Cp = heat capacity (J/mol*K)
H° = standard enthalpy (kJ/mol)
S° = standard entropy (J/mol*K)
t = temperature (K) / 1000.
View plot Requires a JavaScript / HTML 5 canvas capable browser.
Temperature (K) | 298. to 984. |
---|---|
A | 73.11875 |
B | 15.12340 |
C | 5.007997 |
D | -1.627769 |
E | -0.048376 |
F | -628.1021 |
G | 248.6359 |
H | -605.4248 |
Reference | Chase, 1998 |
Comment | Data last reviewed in June, 1974 |

Gas phase ion energetics data

Data compiled as indicated in comments:
LBLHLM - Sharon G. Lias, John E. Bartmess, Joel F. Liebman, John L. Holmes, Rhoda D. Levin, and W. Gary Mallard
LLK - Sharon G. Lias, Rhoda D. Levin, and Sherif A. Kafafi
RDSH - Henry M. Rosenstock, Keith Draxl, Bruce W. Steiner, and John T. Herron
Ionization energy determinations
IE (eV) | Method | Reference | Comment |
---|---|---|---|
8.6 | S | Emons, Kiessling, et al., 1982 | LBLHLM |
8.2 | PE | Lee and Potts, 1979 | LLK |
8.24 | PE | Lee and Potts, 1979, 2 | LLK |
8. ± 1. | EI | Winchell, 1965 | RDSH |
9.3 | PE | Lee and Potts, 1979 | Vertical value; LLK |
8.74 ± 0.01 | PE | Lee and Potts, 1979, 2 | Vertical value; LLK |
9.7 | PE | Hammer, Allen, et al., 1978 | Vertical value; LLK |
Appearance energy determinations
Ion | AE (eV) | Other Products | Method | Reference | Comment |
---|---|---|---|---|---|
Ba+ | 12.45 | I2 | S | Emons, Kiessling, et al., 1982 | LBLHLM |
Ba+ | 13. ± 1. | ? | EI | Winchell, 1965 | RDSH |
BaI+ | 9.2 | I | S | Emons, Kiessling, et al., 1982 | LBLHLM |
BaI+ | 9.0 ± 0.3 | I | EI | Kleinschmidt and Hildenbrand, 1978 | LLK |
BaI+ | 10. ± 1. | I | EI | Winchell, 1965 | RDSH |

Gas phase thermochemistry data

Quantity Value Units Method Reference Comment
Δfgas-302.92kJ/molReviewChase, 1998Data last reviewed in June, 1974
Quantity Value Units Method Reference Comment
gas,1 bar348.14J/mol*KReviewChase, 1998Data last reviewed in June, 1974

Gas Phase Heat Capacity (Shomate Equation)

Cp° = A + B*t + C*t2 + D*t3 + E/t2
H° − H°298.15= A*t + B*t2/2 + C*t3/3 + D*t4/4 − E/t + F − H
S° = A*ln(t) + B*t + C*t2/2 + D*t3/3 − E/(2*t2) + G
    Cp = heat capacity (J/mol*K)
    H° = standard enthalpy (kJ/mol)
    S° = standard entropy (J/mol*K)
    t = temperature (K) / 1000.

View plot Requires a JavaScript / HTML 5 canvas capable browser.

View table.

Temperature (K) 2800. - 6000.
A 58.19107
B 0.008639
C -0.002361
D 0.000203
E -0.065060
F -320.4906
G 418.1908
H -302.9224
ReferenceChase, 1998
Comment Data last reviewed in June, 1974

References

Chase, 1998
Chase, M.W., Jr.,
NIST-JANAF Themochemical Tables, Fourth Edition,
J. Phys. Chem. Ref. Data, Monograph 9, 1998, 1-1951. [all data]
Emons, Kiessling, et al., 1982
Emons, H.-H.; Kiessling, D.; Horlbeck, W.,
Dampfdruckmessungen und massenspektrometrische untersuchungen der gasphase uber erdalkalimetallhalogeniden,
Z. Anorg. Allg. Chem., 1982, 488, 219. [all data]
Lee and Potts, 1979
Lee, E.P.F.; Potts, A.W.,
The HeII α Photoelectron Spectra of the Barium Halides,
Chem. Phys. Lett., 1979, 63, 61. [all data]
Lee and Potts, 1979, 2
Lee, E.P.F.; Potts, A.W.,
An investigation of the valence shell electronic structure of alkaline earth halides by using Ab initio S. C. F. calculations and photoelectron spectroscopy,
Proc. R. Soc. London A:, 1979, 365, 395. [all data]
Winchell, 1965
Winchell, P.,
Mass spectrometric investigation of barium iodide and caesium iodide vaporizations,
Nature, 1965, 206, 1252. [all data]
Hammer, Allen, et al., 1978
Hammer, C.A.; Allen, J.D., Jr.; Cusachs, L.C.; Schweitzer, G.K.,
The high-temperature photoelectron spectra of alkaline-earth chlorides and iodides,
J. Electron Spectrosc. Relat. Phenom., 1978, 13, 149. [all data]
Kleinschmidt and Hildenbrand, 1978
Kleinschmidt, P.D.; Hildenbrand, D.L.,
Dissociation energies of CaI, SrI, and BaI from high temperature mass spectrometry,
J. Chem. Phys., 1978, 68, 2819. [all data]