Dibromochloroborane(3)
- Formula: BBr2Cl
- Molecular weight: 206.072
- CAS Registry Number: 13709-71-2

Gas phase thermochemistry data

Quantity | Value | Units | Method | Reference | Comment |
---|---|---|---|---|---|
ΔfH°gas | -271.96 | kJ/mol | Review | Chase, 1998 | Data last reviewed in December, 1964 |
Quantity | Value | Units | Method | Reference | Comment |
S°gas,1 bar | 321.75 | J/mol*K | Review | Chase, 1998 | Data last reviewed in December, 1964 |
Gas Phase Heat Capacity (Shomate Equation)
Cp° = A + B*t + C*t2 + D*t3 +
E/t2
H° − H°298.15= A*t + B*t2/2 +
C*t3/3 + D*t4/4 − E/t + F − H
S° = A*ln(t) + B*t + C*t2/2 + D*t3/3 −
E/(2*t2) + G
Cp = heat capacity (J/mol*K)
H° = standard enthalpy (kJ/mol)
S° = standard entropy (J/mol*K)
t = temperature (K) / 1000.
View plot Requires a JavaScript / HTML 5 canvas capable browser.
Temperature (K) | 298. to 6000. |
---|---|
A | 78.59770 |
B | 3.800264 |
C | -1.017730 |
D | 0.086212 |
E | -1.265251 |
F | -299.7949 |
G | 408.6605 |
H | -271.9604 |
Reference | Chase, 1998 |
Comment | Data last reviewed in December, 1964 |

Gas phase ion energetics data

Data compiled as indicated in comments:
RDSH - Henry M. Rosenstock, Keith Draxl, Bruce W. Steiner, and John T. Herron
B - John E. Bartmess
Electron affinity determinations
EA (eV) | Method | Reference | Comment |
---|---|---|---|
0.94 ± 0.20 | NBIE | Rothe, Mathur, et al., 1980 | B |
Ionization energy determinations
IE (eV) | Method | Reference | Comment |
---|---|---|---|
10.79 ± 0.06 | EI | Lappert, Pedley, et al., 1966 | RDSH |

References

Chase, 1998
Chase, M.W., Jr.,
NIST-JANAF Themochemical Tables, Fourth Edition,
J. Phys. Chem. Ref. Data, Monograph 9, 1998, 1-1951. [all data]
Rothe, Mathur, et al., 1980
Rothe, E.W.; Mathur, B.P.; Reck, G.P.,
Measurement of boron trihalide electron affinites: Correlation with boron-nitrogen adduct strengths,
Inorg. Chem., 1980, 19, 829. [all data]
Lappert, Pedley, et al., 1966
Lappert, M.F.; Pedley, J.B.; Riley, P.N.K.; Tweedale, A.,
Ionisation potentials and electronic spectra of halogeno- and amino-boranes, and a study of some redistribution reactions,
Chem. Commun., 1966, 788. [all data]