Sulfur tetrafluoride oxide
- Formula: F4OS
- Molecular weight: 124.058
- IUPAC Standard InChIKey: DUGWRBKBGKTKOX-UHFFFAOYSA-N
- CAS Registry Number: 13709-54-1
- Chemical structure:
View 3d structure (requires JavaScript / HTML 5) - Other names: Sulfur fluoride oxide (SF4O); Thionyl tetrafluoride; SOF4

Phase change data

Data compiled by: William E. Acree, Jr., James S. Chickos
Enthalpy of vaporization
ΔvapH (kJ/mol) | Temperature (K) | Reference | Comment |
---|---|---|---|
21.4 | 181. | Dykyj, Svoboda, et al., 1999 | Based on data from 166. to 240. K. |

Reaction thermochemistry data

Data compiled as indicated in comments:
B - John E. Bartmess
M - Michael M. Meot-Ner (Mautner) and Sharon G. Lias
Individual Reactions
By formula: F- + F4OS = (F- • F4OS)
Quantity | Value | Units | Method | Reference | Comment |
---|---|---|---|---|---|
ΔrH° | 243. ± 13. | kJ/mol | IMRE | Larson and McMahon, 1987 | gas phase; These relative affinities are ca. 10 kcal/mol weaker than threshold values (see Wenthold and Squires, 1995) for donors greater than ca. 27 kcal/mol in free energy. This discrepancy has not yet been resolved, though the stronger value appears preferable.; B,M |
ΔrH° | 280. ± 42. | kJ/mol | IMRB | Arnold, Miller, et al., 2002 | gas phase; B |
Quantity | Value | Units | Method | Reference | Comment |
ΔrG° | 220. ± 8.4 | kJ/mol | IMRE | Larson and McMahon, 1987 | gas phase; These relative affinities are ca. 10 kcal/mol weaker than threshold values (see Wenthold and Squires, 1995) for donors greater than ca. 27 kcal/mol in free energy. This discrepancy has not yet been resolved, though the stronger value appears preferable.; B |

Gas phase ion energetics data

Data compiled as indicated in comments:
LLK - Sharon G. Lias, Rhoda D. Levin, and Sherif A. Kafafi
Ionization energy determinations
IE (eV) | Method | Reference | Comment |
---|---|---|---|
12.3 | PE | Costa, Lloyd, et al., 1981 | LLK |
12.8 ± 0.1 | PE | Costa, Lloyd, et al., 1981 | Vertical value; LLK |

Ion clustering data

Data compiled as indicated in comments:
B - John E. Bartmess
M - Michael M. Meot-Ner (Mautner) and Sharon G. Lias
Clustering reactions
By formula: F- + F4OS = (F- • F4OS)
Quantity | Value | Units | Method | Reference | Comment |
---|---|---|---|---|---|
ΔrH° | 243. ± 13. | kJ/mol | IMRE | Larson and McMahon, 1987 | gas phase; These relative affinities are ca. 10 kcal/mol weaker than threshold values (see Wenthold and Squires, 1995) for donors greater than ca. 27 kcal/mol in free energy. This discrepancy has not yet been resolved, though the stronger value appears preferable.; B,M |
ΔrH° | 280. ± 42. | kJ/mol | IMRB | Arnold, Miller, et al., 2002 | gas phase; B |
Quantity | Value | Units | Method | Reference | Comment |
ΔrG° | 220. ± 8.4 | kJ/mol | IMRE | Larson and McMahon, 1987 | gas phase; These relative affinities are ca. 10 kcal/mol weaker than threshold values (see Wenthold and Squires, 1995) for donors greater than ca. 27 kcal/mol in free energy. This discrepancy has not yet been resolved, though the stronger value appears preferable.; B |

References

Dykyj, Svoboda, et al., 1999
Dykyj, J.; Svoboda, J.; Wilhoit, R.C.; Frenkel, M.L.; Hall, K.R.,
Vapor Pressure of Chemicals: Part A. Vapor Pressure and Antoine Constants for Hydrocarbons and Sulfur, Selenium, Tellurium and Hydrogen Containing Organic Compounds, Springer, Berlin, 1999, 373. [all data]
Larson and McMahon, 1987
Larson, J.W.; McMahon, T.B.,
Trends in Gas Phase Fluoride Ion Affinities of the Main Group Oxyfluorides and Fluoride Sulfides. Fluoride Adducts of FAsO, FPO, FPO2, F2SiO, F4SO, FBO, F2SiS, FPS, FAsS, F2S2, and S2O.,
Inorg. Chem., 1987, 26, 24, 4018, https://doi.org/10.1021/ic00271a011
. [all data]
Wenthold and Squires, 1995
Wenthold, P.G.; Squires, R.R.,
Bond dissociation energies of F2(-) and HF2(-). A gas-phase experimental and G2 theoretical study,
J. Phys. Chem., 1995, 99, 7, 2002, https://doi.org/10.1021/j100007a034
. [all data]
Arnold, Miller, et al., 2002
Arnold, S.T.; Miller, T.M.; Viggiano, A.A.,
A combined experimental and theoretical study of sulfur oxyfluoride anion and neutral thermochemistry and reactivity,
J. Phys. Chem. A, 2002, 106, 42, 9900-9909, https://doi.org/10.1021/jp020557w
. [all data]
Costa, Lloyd, et al., 1981
Costa, N.C.V.; Lloyd, D.R.; Roberts, P.J.; Cruickshank, D.W.J.; Avramides, E.; Chablo, A.; Collins, G.A.D.; Dobson, B.; Hillier, I.H.,
Experimental and theoretical study of the electronic structures of thionyl fluoride, sulphur tetrafluoride and sulphur tetrafluoride Oxode,
J. Chem. Soc. Faraday Trans. 2, 1981, 77, 899. [all data]