praseodymium trifluoride
- Formula: F3Pr
- Molecular weight: 197.90286
- CAS Registry Number: 13709-46-1

Gas phase ion energetics data

Data compiled by: Henry M. Rosenstock, Keith Draxl, Bruce W. Steiner, and John T. Herron
Appearance energy determinations
Ion | AE (eV) | Other Products | Method | Reference | Comment |
---|---|---|---|---|---|
PrF+ | 19.0 ± 0.7 | ? | EI | Zmbov and Margrave, 1968 | |
PrF2+ | 12.5 ± 0.7 | F | EI | Zmbov and Margrave, 1968 | |
Pr+ | 27.5 ± 0.7 | ? | EI | Zmbov and Margrave, 1968 |

References

Zmbov and Margrave, 1968
Zmbov, K.F.; Margrave, J.L.,
Mass spectrometric studies of scandium, yttrium, lanthanum, and rare-earth fluorides,
Advan. Chem. Ser., 1968, 72, 267. [all data]