neodymium trifluoride
- Formula: F3Nd
- Molecular weight: 201.237
- CAS Registry Number: 13709-42-7

Gas phase ion energetics data

Data compiled by: Henry M. Rosenstock, Keith Draxl, Bruce W. Steiner, and John T. Herron
Appearance energy determinations
Ion | AE (eV) | Other Products | Method | Reference | Comment |
---|---|---|---|---|---|
NdF+ | 19.8 ± 0.3 | ? | EI | Zmbov and Margrave, 1966 | |
NdF2+ | 12.9 ± 0.3 | F | EI | Zmbov and Margrave, 1966 | |
Nd+ | 25.5 ± 0.3 | ? | EI | Zmbov and Margrave, 1966 |

References

Zmbov and Margrave, 1966
Zmbov, K.F.; Margrave, J.L.,
Mass-spectrometric studies at high temperatures. XI.The sublimation pressure of NdF, and the stabilities of gaseous NdF2 and NdF,
J. Chem. Phys., 1966, 45, 3167. [all data]