Difluoroaminosulfonyl fluoride
- Formula: F3NO2S
- Molecular weight: 135.066
- IUPAC Standard InChIKey: SXKLNBJCHYEPDL-UHFFFAOYSA-N
- CAS Registry Number: 13709-30-3
- Chemical structure:
View 3d structure (requires JavaScript / HTML 5) - Permanent link for this species. Use this link for bookmarking this species for future reference.

Gas phase ion energetics data

Data compiled by: Henry M. Rosenstock, Keith Draxl, Bruce W. Steiner, and John T. Herron
Appearance energy determinations
Ion | AE (eV) | Other Products | Method | Reference | Comment |
---|---|---|---|---|---|
SO2F+ | 13.1 ± 0.1 | ? | EI | Paulett and Lustig, 1965 | |
NF2+ | 14.6 ± 0.3 | ? | EI | Paulett and Lustig, 1965 |

References

Paulett and Lustig, 1965
Paulett, G.S.; Lustig, M.,
Sulfur-nitrogen and oxygen-nitrogen bond dissociation energies of some N-fluorinated amines,
J. Am. Chem. Soc., 1965, 87, 1020. [all data]