Benzenethiol, 2-amino-
- Formula: C6H7NS
- Molecular weight: 125.191
- IUPAC Standard InChIKey: VRVRGVPWCUEOGV-UHFFFAOYSA-N
- CAS Registry Number: 137-07-5
- Chemical structure:
View 3d structure (requires JavaScript / HTML 5) - Other names: o-Mercaptoaniline; Benzenethiol, o-amino-; o-Aminobenzenethiol; o-Aminothiophenol; 1-Amino-2-mercaptobenzene; 2-Aminobenzenethiol; 2-Aminothiophenol; 2-Mercaptaniline; 2-Mercaptoaniline; o-Aminophenyl mercaptan; USAF EK-4376; 2-Aminophenyl mercaptan; 2-Amino-1-mercaptobenzene

Phase change data

Data compiled by: Robert L. Brown and Stephen E. Stein
Quantity | Value | Units | Method | Reference | Comment |
---|---|---|---|---|---|
Tboil | 507.2 | K | N/A | Weast and Grasselli, 1989 | |
Tboil | 507. | K | N/A | Buckingham and Donaghy, 1982 | |
Quantity | Value | Units | Method | Reference | Comment |
Tfus | 299. | K | N/A | Buckingham and Donaghy, 1982 |
Reduced pressure boiling point
Tboil (K) | Pressure (bar) | Reference |
---|---|---|
367. to 370. | 0.005 | Buckingham and Donaghy, 1982 |
398. to 400. | 0.008 | Buckingham and Donaghy, 1982 |

Gas phase ion energetics data

Data compiled by: Sharon G. Lias, John E. Bartmess, Joel F. Liebman, John L. Holmes, Rhoda D. Levin, and W. Gary Mallard
Ionization energy determinations
IE (eV) | Method | Reference | Comment |
---|---|---|---|
7.6 | PE | Zverev, Ashrafullina, et al., 1982 | |
8.00 | PE | Zverev, Ashrafullina, et al., 1982 | Vertical value |

References

Weast and Grasselli, 1989
CRC Handbook of Data on Organic Compounds, 2nd Editon, Weast,R.C and Grasselli, J.G., ed(s)., CRC Press, Inc., Boca Raton, FL, 1989, 1. [all data]
Buckingham and Donaghy, 1982
Buckingham, J.; Donaghy, S.M.,
Dictionary of Organic Compounds: Fifth Edition, Chapman and Hall, New York, 1982, 1. [all data]
Zverev, Ashrafullina, et al., 1982
Zverev, V.V.; Ashrafullina, L.K.; Villem, Y.Y.; Villem, N.V.; Shagidullin, R.R.,
Photoelectron spectrum and electronic and steric structure of o-aminothiophenol,
Izv. Akad. Nauk SSSR Ser. Khim., 1982, 2165. [all data]