Benzenethiol, 2-methyl-
- Formula: C7H8S
- Molecular weight: 124.203
- IUPAC Standard InChIKey: LXUNZSDDXMPKLP-UHFFFAOYSA-N
- CAS Registry Number: 137-06-4
- Chemical structure:
View 3d structure (requires JavaScript / HTML 5) - Other names: o-Toluenethiol; o-Mercaptotoluene; o-Methylbenzenethiol; o-Methylthiophenol; o-Thiocresol; o-Tolyl mercaptan; 2-Methylbenzenethiol; 2-Methylthiophenol; 2-Toluenethiol; USAF EK-2676; 2-Methylbenzothiol; 2-Methylphenylthiol; NSC 80655; toluene-2-thiol

Phase change data

Data compiled as indicated in comments:
BS - Robert L. Brown and Stephen E. Stein
AC - William E. Acree, Jr., James S. Chickos
Quantity | Value | Units | Method | Reference | Comment |
---|---|---|---|---|---|
Tboil | 468.2 | K | N/A | Weast and Grasselli, 1989 | BS |
Enthalpy of vaporization
ΔvapH (kJ/mol) | Temperature (K) | Method | Reference | Comment |
---|---|---|---|---|
48.1 | 366. | N/A | Dykyj, Svoboda, et al., 1999 | Based on data from 351. to 498. K.; AC |
46.6 | 394. | A | Stephenson and Malanowski, 1987 | Based on data from 370. to 470. K.; AC |

Gas phase ion energetics data

Data compiled by: Sharon G. Lias, Rhoda D. Levin, and Sherif A. Kafafi
Ionization energy determinations
IE (eV) | Method | Reference | Comment |
---|---|---|---|
8.31 | PE | Dewar, Ernstbrunner, et al., 1974 | Vertical value |

References

Weast and Grasselli, 1989
CRC Handbook of Data on Organic Compounds, 2nd Editon, Weast,R.C and Grasselli, J.G., ed(s)., CRC Press, Inc., Boca Raton, FL, 1989, 1. [all data]
Dykyj, Svoboda, et al., 1999
Dykyj, J.; Svoboda, J.; Wilhoit, R.C.; Frenkel, M.L.; Hall, K.R.,
Vapor Pressure of Chemicals: Part A. Vapor Pressure and Antoine Constants for Hydrocarbons and Sulfur, Selenium, Tellurium and Hydrogen Containing Organic Compounds, Springer, Berlin, 1999, 373. [all data]
Stephenson and Malanowski, 1987
Stephenson, Richard M.; Malanowski, Stanislaw,
Handbook of the Thermodynamics of Organic Compounds, 1987, https://doi.org/10.1007/978-94-009-3173-2
. [all data]
Dewar, Ernstbrunner, et al., 1974
Dewar, P.S.; Ernstbrunner, E.; Gilmore, J.R.; Godfrey, M.; Mellor, J.M.,
Conformational analysis of alkyl aryl ethers and alkyl aryl sulphides by photoelectron spectroscopy,
Tetrahedron, 1974, 30, 2455. [all data]
Abu-Eittah and Hilal, 1972
Abu-Eittah, R.H.; Hilal, R.H.,
Appl. Spectroscopy, 1972, 26, 270. [all data]