Mecrylate
- Formula: C5H5NO2
- Molecular weight: 111.0987
- IUPAC Standard InChIKey: MWCLLHOVUTZFKS-UHFFFAOYSA-N
- CAS Registry Number: 137-05-3
- Chemical structure:
View 3d structure (requires JavaScript / HTML 5) - Other names: 2-Propenoic acid, 2-cyano-, methyl ester; Acrylic acid, 2-cyano-, methyl ester; α-Cyanoacrylic acid, methyl ester; Adhere; Coapt.; Cyanolit; Eastman 910; Eastman 910 Adhesive; Eastman 910 monomer; Mecrilat; Methyl α-cyanoacrylate; Methyl cyanoacrylate; Methyl 2-cyanoacrylate; 2-Cyanoacrylic acid, methyl ester; Coapt; Mecrilate; Methyl ester of 2-cyano-2-propenoic acid

Phase change data

Data compiled as indicated in comments:
BS - Robert L. Brown and Stephen E. Stein
AC - William E. Acree, Jr., James S. Chickos
Reduced pressure boiling point
Tboil (K) | Pressure (bar) | Reference | Comment |
---|---|---|---|
320.7 | 0.003 | Weast and Grasselli, 1989 | BS |
Enthalpy of vaporization
ΔvapH (kJ/mol) | Temperature (K) | Method | Reference | Comment |
---|---|---|---|---|
57.8 | 270. | A | Stephenson and Malanowski, 1987 | Based on data from 258. to 283. K. See also Woodman and Adicoff, 1969 and Dykyj, 1972.; AC |

Gas phase ion energetics data

Data compiled by: Sharon G. Lias, Rhoda D. Levin, and Sherif A. Kafafi
Ionization energy determinations
IE (eV) | Method | Reference | Comment |
---|---|---|---|
10.98 ± 0.05 | PE | Houk and Munchausen, 1976 | Vertical value |

References

Weast and Grasselli, 1989
CRC Handbook of Data on Organic Compounds, 2nd Editon, Weast,R.C and Grasselli, J.G., ed(s)., CRC Press, Inc., Boca Raton, FL, 1989, 1. [all data]
Stephenson and Malanowski, 1987
Stephenson, Richard M.; Malanowski, Stanislaw,
Handbook of the Thermodynamics of Organic Compounds, 1987, https://doi.org/10.1007/978-94-009-3173-2
. [all data]
Woodman and Adicoff, 1969
Woodman, Alan L.; Adicoff, Arnold,
Vapor pressure of methyl 2-cyanoacrylate,
J. Chem. Eng. Data, 1969, 14, 4, 479-480, https://doi.org/10.1021/je60043a019
. [all data]
Dykyj, 1972
Dykyj, J.,
Petrochemia, 1972, 12, 1, 13. [all data]
Houk and Munchausen, 1976
Houk, K.N.; Munchausen, L.L.,
Ionization potentials, electron affinities, reactivities of cyanoalkenes related electron-deficient alkenes. A frontier molecular orbital treatment of cyanoalkene reactivities in cycloaddition, electrophilic, nucleophilic, and radical reactions.,
J. Am. Chem. Soc., 1976, 98, 937. [all data]