Diboron tetrachloride
- Formula: B2Cl4
- Molecular weight: 163.434
- IUPAC Standard InChIKey: LCWVIHDXYOFGEG-UHFFFAOYSA-N
- CAS Registry Number: 13701-67-2
- Chemical structure:
View 3d structure (requires JavaScript / HTML 5) - Permanent link for this species. Use this link for bookmarking this species for future reference.

Gas phase thermochemistry data

Quantity | Value | Units | Method | Reference | Comment |
---|---|---|---|---|---|
ΔfH°gas | -489.11 | kJ/mol | Review | Chase, 1998 | Data last reviewed in December, 1964 |
Quantity | Value | Units | Method | Reference | Comment |
S°gas,1 bar | 358.26 | J/mol*K | Review | Chase, 1998 | Data last reviewed in December, 1964 |
Gas Phase Heat Capacity (Shomate Equation)
Cp° = A + B*t + C*t2 + D*t3 +
E/t2
H° − H°298.15= A*t + B*t2/2 +
C*t3/3 + D*t4/4 − E/t + F − H
S° = A*ln(t) + B*t + C*t2/2 + D*t3/3 −
E/(2*t2) + G
Cp = heat capacity (J/mol*K)
H° = standard enthalpy (kJ/mol)
S° = standard entropy (J/mol*K)
t = temperature (K) / 1000.
View plot Requires a JavaScript / HTML 5 canvas capable browser.
Temperature (K) | 298. to 6000. |
---|---|
A | 119.1164 |
B | 7.929810 |
C | -2.087322 |
D | 0.174912 |
E | -2.427386 |
F | -533.2926 |
G | 486.4820 |
H | -489.1096 |
Reference | Chase, 1998 |
Comment | Data last reviewed in December, 1964 |

Gas phase ion energetics data

Data compiled as indicated in comments:
LLK - Sharon G. Lias, Rhoda D. Levin, and Sherif A. Kafafi
RDSH - Henry M. Rosenstock, Keith Draxl, Bruce W. Steiner, and John T. Herron
Ionization energy determinations
IE (eV) | Method | Reference | Comment |
---|---|---|---|
≤10.42 ± 0.02 | PE | Lynaugh, Lloyd, et al., 1972 | LLK |
10.32 ± 0.02 | PI | Dibeler and Walker, 1969 | RDSH |
Appearance energy determinations
Ion | AE (eV) | Other Products | Method | Reference | Comment |
---|---|---|---|---|---|
BCl+ | 13.71 ± 0.04 | BCl3 | PI | Dibeler and Walker, 1969 | RDSH |
BCl2+ | 11.32 ± 0.02 | BCl2 | PI | Dibeler and Walker, 1969 | RDSH |
B2Cl2+ | 17.24 ± 0.03 | 2Cl? | PI | Dibeler and Walker, 1969 | RDSH |
B2Cl3+ | 11.52 ± 0.02 | Cl | PI | Dibeler and Walker, 1969 | RDSH |

References

Chase, 1998
Chase, M.W., Jr.,
NIST-JANAF Themochemical Tables, Fourth Edition,
J. Phys. Chem. Ref. Data, Monograph 9, 1998, 1-1951. [all data]
Lynaugh, Lloyd, et al., 1972
Lynaugh, N.; Lloyd, D.R.; Guest, M.F.; Hall, M.B.; Hillier, I.H.,
Photoelectron studies of boron compounds. Part 4. Experimental and theoretical studies of diboron and tetrachloride diboron tetrafluoride,
J. Chem. Soc. Faraday Trans. 2, 1972, 68. [all data]
Dibeler and Walker, 1969
Dibeler, V.H.; Walker, J.A.,
Mass spectrometric study of photoionization. XIII.Boron trichloride and diborontetrachloride,
Inorg. Chem., 1969, 8, 50. [all data]