1-Methyl-4-methylidenepiperidine
- Formula: C7H13N
- Molecular weight: 111.1848
- IUPAC Standard InChIKey: XOLRMKKIFJFIOV-UHFFFAOYSA-N
- CAS Registry Number: 13669-28-8
- Chemical structure:
View 3d structure (requires JavaScript / HTML 5) - Other names: Piperidine, 1-methyl,4-methylene-

Gas phase ion energetics data

Data compiled as indicated in comments:
LBLHLM - Sharon G. Lias, John E. Bartmess, Joel F. Liebman, John L. Holmes, Rhoda D. Levin, and W. Gary Mallard
LLK - Sharon G. Lias, Rhoda D. Levin, and Sherif A. Kafafi
Ionization energy determinations
IE (eV) | Method | Reference | Comment |
---|---|---|---|
8.36 | PE | Spanka and Rademacher, 1986 | Vertical value; LBLHLM |
9.05 | PE | Sarneel, Worrell, et al., 1980 | Vertical value; LLK |

References

Spanka and Rademacher, 1986
Spanka, G.; Rademacher, P.,
Transannular interactions in difunctional medium rings. 1. n/π Interactions in cyclic amino ketones and aminoalkenes studied by photoelectron spectroscopy,
J. Org. Chem., 1986, 51, 592. [all data]
Sarneel, Worrell, et al., 1980
Sarneel, R.; Worrell, C.W.; Pasman, P.; Verhoeven, J.W.; Mes, G.F.,
The photoelectron spectra of 4-methylene thiacyclohexane derivatives through-bond interaction,
Tetrahedron, 1980, 36, 3241. [all data]