Arsine, dimethylvinyl-
- Formula: C4H9As
- Molecular weight: 132.0359
- IUPAC Standard InChIKey: VSAHOCVUSNZZEQ-UHFFFAOYSA-N
- CAS Registry Number: 13652-14-7
- Chemical structure:
View 3d structure (requires JavaScript / HTML 5) - Permanent link for this species. Use this link for bookmarking this species for future reference.

Gas phase ion energetics data

Data compiled by: Sharon G. Lias, Rhoda D. Levin, and Sherif A. Kafafi
Ionization energy determinations
IE (eV) | Method | Reference | Comment |
---|---|---|---|
8.68 | PE | Schmidt, Schweig, et al., 1977 | Vertical value |

References

Schmidt, Schweig, et al., 1977
Schmidt, H.; Schweig, A.; Vermeer, H.,
On the conformation of unsaturated arsines,
J. Mol. Struct., 1977, 37, 93. [all data]