1,2-Pentadiene, 4-methyl-
- Formula: C6H10
- Molecular weight: 82.1436
- IUPAC Standard InChIKey: CAAAXQFHDYHTTC-UHFFFAOYSA-N
- CAS Registry Number: 13643-05-5
- Chemical structure:
View 3d structure (requires JavaScript / HTML 5) - Permanent link for this species. Use this link for bookmarking this species for future reference.

Phase change data

Data compiled by: Thermodynamics Research Center, NIST Boulder Laboratories, Chris Muzny director
Quantity | Value | Units | Method | Reference | Comment |
---|---|---|---|---|---|
Tboil | 343. | K | N/A | Bouis, 1928 | Uncertainty assigned by TRC = 0.6 K |

Gas phase ion energetics data

Data compiled as indicated in comments:
LLK - Sharon G. Lias, Rhoda D. Levin, and Sherif A. Kafafi
Ionization energy determinations
IE (eV) | Method | Reference | Comment |
---|---|---|---|
9.06 ± 0.05 | EI | Wolkoff, Holmes, et al., 1980 | LLK |
Appearance energy determinations
Ion | AE (eV) | Other Products | Method | Reference | Comment |
---|---|---|---|---|---|
C5H7+ | 9.78 ± 0.05 | CH3 | EI | Wolkoff, Holmes, et al., 1980 | LLK |

References

Bouis, 1928
Bouis, M.,
Ann. Chim. (Paris), 1928, 9, 402. [all data]
Wolkoff, Holmes, et al., 1980
Wolkoff, P.; Holmes, J.L.; Lossing, F.P.,
On the formation of cyclopentenium cations from all C6H10+ molecular ion structures,
Can. J. Chem., 1980, 58, 251. [all data]