Sulfuryl chloride fluoride
- Formula: ClFO2S
- Molecular weight: 118.515
- IUPAC Standard InChIKey: IXPAAHZTOUOJJM-UHFFFAOYSA-N
- CAS Registry Number: 13637-84-8
- Chemical structure:
View 3d structure (requires JavaScript / HTML 5) - Other names: Sulfonyl chloride fluoride; Chloro fluoro sulfone; Chlorosulfonyl fluoride; Fluorosulfuryl chloride; Sulfuryl fluoride chloride; SO2FCl; Sulfuryl chlorofluoride; Fluorosulfonyl chloride; Sulfuryl fluorochloride; TL 212; SO2ClF; chlorosulphonyl fluoride

Gas phase thermochemistry data

Quantity | Value | Units | Method | Reference | Comment |
---|---|---|---|---|---|
ΔfH°gas | -556.47 | kJ/mol | Review | Chase, 1998 | Data last reviewed in June, 1971 |
Quantity | Value | Units | Method | Reference | Comment |
S°gas,1 bar | 302.84 | J/mol*K | Review | Chase, 1998 | Data last reviewed in June, 1971 |
Gas Phase Heat Capacity (Shomate Equation)
Cp° = A + B*t + C*t2 + D*t3 +
E/t2
H° − H°298.15= A*t + B*t2/2 +
C*t3/3 + D*t4/4 − E/t + F − H
S° = A*ln(t) + B*t + C*t2/2 + D*t3/3 −
E/(2*t2) + G
Cp = heat capacity (J/mol*K)
H° = standard enthalpy (kJ/mol)
S° = standard entropy (J/mol*K)
t = temperature (K) / 1000.
View plot Requires a JavaScript / HTML 5 canvas capable browser.
Temperature (K) | 298. to 1100. | 1100. to 6000. |
---|---|---|
A | 48.72561 | 106.8861 |
B | 128.2237 | 0.669687 |
C | -108.8455 | -0.135353 |
D | 33.52028 | 0.009367 |
E | -0.586095 | -6.437879 |
F | -577.7727 | -605.8641 |
G | 324.8248 | 406.2710 |
H | -556.4720 | -556.4720 |
Reference | Chase, 1998 | Chase, 1998 |
Comment | Data last reviewed in June, 1971 | Data last reviewed in June, 1971 |

Phase change data

Data compiled by: William E. Acree, Jr., James S. Chickos
Enthalpy of vaporization
ΔvapH (kJ/mol) | Temperature (K) | Reference | Comment |
---|---|---|---|
29.0 | 226. | Dykyj, Svoboda, et al., 1999 | Based on data from 211. to 300. K. |

Gas phase ion energetics data

Data compiled as indicated in comments:
LLK - Sharon G. Lias, Rhoda D. Levin, and Sherif A. Kafafi
Ionization energy determinations
IE (eV) | Method | Reference | Comment |
---|---|---|---|
12.3 ± 0.5 | EI | Sullivan and Beauchamp, 1978 | LLK |
12.4 | PE | Mines, Thomas, et al., 1972 | LLK |
12.61 | PE | Mines, Thomas, et al., 1972 | Vertical value; LLK |
Appearance energy determinations
Ion | AE (eV) | Other Products | Method | Reference | Comment |
---|---|---|---|---|---|
O2FS+ | 13.0 ± 0.5 | Cl | EI | Sullivan and Beauchamp, 1978 | LLK |

References

Chase, 1998
Chase, M.W., Jr.,
NIST-JANAF Themochemical Tables, Fourth Edition,
J. Phys. Chem. Ref. Data, Monograph 9, 1998, 1-1951. [all data]
Dykyj, Svoboda, et al., 1999
Dykyj, J.; Svoboda, J.; Wilhoit, R.C.; Frenkel, M.L.; Hall, K.R.,
Vapor Pressure of Chemicals: Part A. Vapor Pressure and Antoine Constants for Hydrocarbons and Sulfur, Selenium, Tellurium and Hydrogen Containing Organic Compounds, Springer, Berlin, 1999, 373. [all data]
Sullivan and Beauchamp, 1978
Sullivan, S.A.; Beauchamp, J.L.,
Positive and negative ion chemistry of sulfuryl halides,
Int. J. Mass Spectrom. Ion Phys., 1978, 28, 69. [all data]
Mines, Thomas, et al., 1972
Mines, G.W.; Thomas, R.K.; Thompson, H.,
Photoelectron spectra of compounds containing thionyl and sulphuryl groups,
Proc. R. Soc. London A:, 1972, 329, 275. [all data]