Molybdenum dichloride dioxide

Gas phase ion energetics data

Data compiled as indicated in comments:
LLK - Sharon G. Lias, Rhoda D. Levin, and Sherif A. Kafafi

Ionization energy determinations

IE (eV) Method Reference Comment
11.93 ± 0.02PEBurroughs, Evans, et al., 1974LLK

Gas phase thermochemistry data

Quantity Value Units Method Reference Comment
Δfgas-151.30kcal/molReviewChase, 1998Data last reviewed in June, 1970
Quantity Value Units Method Reference Comment
gas,1 bar80.688cal/mol*KReviewChase, 1998Data last reviewed in June, 1970

Gas Phase Heat Capacity (Shomate Equation)

Cp° = A + B*t + C*t2 + D*t3 + E/t2
H° − H°298.15= A*t + B*t2/2 + C*t3/3 + D*t4/4 − E/t + F − H
S° = A*ln(t) + B*t + C*t2/2 + D*t3/3 − E/(2*t2) + G
    Cp = heat capacity (cal/mol*K)
    H° = standard enthalpy (kcal/mol)
    S° = standard entropy (cal/mol*K)
    t = temperature (K) / 1000.

View plot Requires a JavaScript / HTML 5 canvas capable browser.

View table.

Temperature (K) 298. - 6000.
A 24.31960
B 1.258771
C -0.336085
D 0.028416
E -0.399374
F -159.9430
G 107.5120
H -151.3000
ReferenceChase, 1998
Comment Data last reviewed in June, 1970

References

Burroughs, Evans, et al., 1974
Burroughs, P.; Evans, S.; Hamnett, A.; Orchard, A.F.; Richardson, N.V., He-I photoelectron spectra of some d (0) transition metal compounds, J. Chem. Soc. Faraday Trans. 2, 1974, 70, 1895. [all data]