Manganese, pentacarbonylmethyl-
- Formula: C6H3MnO5
- Molecular weight: 210.0231
- IUPAC Standard InChIKey: KJJLHDHVFFAISC-UHFFFAOYSA-N
- CAS Registry Number: 13601-24-6
- Chemical structure:
View 3d structure (requires JavaScript / HTML 5) - Other names: Manganese, pentacarbonylmethyl-, (OC-6-21)-; Methyl pentacarbonylmanganese; Methylmanganese pentacarbonyl; Pentacarbonylmethylmanganese; CH3(CO)5Mn

Gas phase thermochemistry data

Data compiled by: José A. Martinho Simões
Quantity | Value | Units | Method | Reference | Comment |
---|---|---|---|---|---|
ΔfH°gas | -756. ± 6. | kJ/mol | Review | Martinho Simões | |
ΔfH°gas | -750.9 ± 4.1 | kJ/mol | Review | Martinho Simões | Selected data |

Condensed phase thermochemistry data

Data compiled by: José A. Martinho Simões
Quantity | Value | Units | Method | Reference | Comment |
---|---|---|---|---|---|
ΔfH°solid | -811.2 ± 3.7 | kJ/mol | Review | Martinho Simões | Selected data |
ΔfH°solid | -816. ± 6. | kJ/mol | HAL-HFC | Connor, Zafarani-Moattar, et al., 1982 | Value corrected based on a set of ancillary data by J.A. Martinho Simões; Please also see Brown, Connor, et al., 1974. |

Phase change data

Data compiled as indicated in comments:
MS - José A. Martinho Simões
AC - William E. Acree, Jr., James S. Chickos
Quantity | Value | Units | Method | Reference | Comment |
---|---|---|---|---|---|
ΔsubH° | 60.3 ± 1.7 | kJ/mol | HAL-HFC | Hieber and Braun, 1958 | MS |
Enthalpy of sublimation
ΔsubH (kJ/mol) | Temperature (K) | Reference | Comment |
---|---|---|---|
60.2 | 293. to 403. | Hieber and Wagner, 1958 | AC |

Reaction thermochemistry data

Data compiled by: José A. Martinho Simões
Individual Reactions
(g) = C5MnO5 (g) +
(g)
By formula: C6H3MnO5 (g) = C5MnO5 (g) + CH4 (g)
Quantity | Value | Units | Method | Reference | Comment |
---|---|---|---|---|---|
ΔrH° | 192. ± 15. | kJ/mol | PIMS | Martinho Simões and Beauchamp, 1990 | The reaction enthalpy was derived from the appearance energy of Mn(CO)5(+), 940.7 ± 4.8 kJ/mol, using Mn(CO)5(Me) as the neutral precursor, together with the adiabatic ionization energy of Mn(CO)5 radical, 749. ± 14. kJ/mol Martinho Simões and Beauchamp, 1990 |
(solution) +
(solution) =
(solution)
By formula: C6H3MnO5 (solution) + CO (solution) = C7H3MnO6 (solution)
Quantity | Value | Units | Method | Reference | Comment |
---|---|---|---|---|---|
ΔrH° | -56.1 ± 4.2 | kJ/mol | RSC | Nolan, López de la Vega, et al., 1986 | solvent: Tetrahydrofuran |
ΔrH° | -52.7 | kJ/mol | EqS | Calderazzo, 1977 | solvent: 2,2'-diethoxydiethyl ether |
(cr) + 1.5
(g) =
(cr) + 5
(g) +
(g)
By formula: C6H3MnO5 (cr) + 1.5Br2 (g) = Br2Mn (cr) + 5CO (g) + CH3Br (g)
Quantity | Value | Units | Method | Reference | Comment |
---|---|---|---|---|---|
ΔrH° | -209. ± 3. | kJ/mol | HAL-HFC | Connor, Zafarani-Moattar, et al., 1982 |
By formula: C7H3MnO6 (cr) = C6H3MnO5 (g) + CO (g)
Quantity | Value | Units | Method | Reference | Comment |
---|---|---|---|---|---|
ΔrH° | 119.3 ± 0.9 | kJ/mol | TD-HFC | Connor, Zafarani-Moattar, et al., 1982 |

Gas phase ion energetics data

Data evaluated as indicated in comments:
HL - Edward P. Hunter and Sharon G. Lias
Data compiled as indicated in comments:
LLK - Sharon G. Lias, Rhoda D. Levin, and Sherif A. Kafafi
RDSH - Henry M. Rosenstock, Keith Draxl, Bruce W. Steiner, and John T. Herron
Quantity | Value | Units | Method | Reference | Comment |
---|---|---|---|---|---|
Proton affinity (review) | 764.4 | kJ/mol | N/A | Hunter and Lias, 1998 | HL |
Quantity | Value | Units | Method | Reference | Comment |
Gas basicity | 735.4 | kJ/mol | N/A | Hunter and Lias, 1998 | HL |
Ionization energy determinations
IE (eV) | Method | Reference | Comment |
---|---|---|---|
8.4 | PE | Lichtenberger and Fenski, 1974 | LLK |
8.65 | PE | Lichtenberger and Fenski, 1974 | Vertical value; LLK |
8.46 | PE | Evans, Green, et al., 1969 | Vertical value; RDSH |

References

Martinho Simões
Martinho Simões, J.A.,
Private communication (see http://webbook.nist.gov/chemistry/om/). [all data]
Connor, Zafarani-Moattar, et al., 1982
Connor, J.A.; Zafarani-Moattar, M.T.; Bickerton, J.; El-Saied, N.I.; Suradi, S.; Carson, R.; Al Takkhin, G.; Skinner, H.A.,
Organomet., 1982, 1, 1166. [all data]
Brown, Connor, et al., 1974
Brown, D.L.S.; Connor, J.A.; Skinner, H.A.,
J. Organometal. Chem., 1974, 81, 403. [all data]
Hieber and Braun, 1958
Hieber, W.; Braun, G.,
Justus Liebigs Ann. Chem., 1958, 24, 618. [all data]
Hieber and Wagner, 1958
Hieber, Walter; Wagner, Gerhard,
Über Organomanganpentacarbonyle, I,
Justus Liebigs Ann. Chem., 1958, 618, 1, 24-30, https://doi.org/10.1002/jlac.19586180104
. [all data]
Martinho Simões and Beauchamp, 1990
Martinho Simões, J.A.; Beauchamp, J.L.,
Chem. Rev., 1990, 90, 629. [all data]
Nolan, López de la Vega, et al., 1986
Nolan, S.P.; López de la Vega, R.; Hoff, C.D.,
J. Am. Chem. Soc., 1986, 108, 7852. [all data]
Calderazzo, 1977
Calderazzo, F.,
Angew. Chem. Int. Ed. Engl., 1977, 16, 299. [all data]
Hunter and Lias, 1998
Hunter, E.P.; Lias, S.G.,
Evaluated Gas Phase Basicities and Proton Affinities of Molecules: An Update,
J. Phys. Chem. Ref. Data, 1998, 27, 3, 413-656, https://doi.org/10.1063/1.556018
. [all data]
Lichtenberger and Fenski, 1974
Lichtenberger, D.I.; Fenski, R.F.,
Assignment of the photoelectron spectra of Mn(CO)5CH3 and Mn(CO)5CF3,
Inorg. Chem., 1974, 13, 486. [all data]
Evans, Green, et al., 1969
Evans, S.; Green, J.C.; Green, M.L.H.; Orchard, A.F.; Turner, D.W.,
Study of the bonding in pentacarbonylmanganese derivatives by photoelectron spectroscopy,
Faraday Discuss. Chem. Soc., 1969, 47, 112. [all data]