Beryllium chloride fluoride
- Formula: BeClF
- Molecular weight: 63.464
- CAS Registry Number: 13598-12-4

Gas phase thermochemistry data

Quantity | Value | Units | Method | Reference | Comment |
---|---|---|---|---|---|
ΔfH°gas | -573.21 | kJ/mol | Review | Chase, 1998 | Data last reviewed in June, 1965 |
Quantity | Value | Units | Method | Reference | Comment |
S°gas,1 bar | 246.49 | J/mol*K | Review | Chase, 1998 | Data last reviewed in June, 1965 |
Gas Phase Heat Capacity (Shomate Equation)
Cp° = A + B*t + C*t2 + D*t3 +
E/t2
H° − H°298.15= A*t + B*t2/2 +
C*t3/3 + D*t4/4 − E/t + F − H
S° = A*ln(t) + B*t + C*t2/2 + D*t3/3 −
E/(2*t2) + G
Cp = heat capacity (J/mol*K)
H° = standard enthalpy (kJ/mol)
S° = standard entropy (J/mol*K)
t = temperature (K) / 1000.
View plot Requires a JavaScript / HTML 5 canvas capable browser.
Temperature (K) | 298. to 1100. | 1100. to 6000. |
---|---|---|
A | 40.83806 | 61.89893 |
B | 45.12904 | 0.254726 |
C | -37.26597 | -0.051212 |
D | 11.20044 | 0.003525 |
E | -0.166014 | -2.394216 |
F | -587.6386 | -598.0986 |
G | 283.0744 | 311.9611 |
H | -573.2080 | -573.2080 |
Reference | Chase, 1998 | Chase, 1998 |
Comment | Data last reviewed in June, 1965 | Data last reviewed in June, 1965 |

Gas phase ion energetics data

Data compiled by: Sharon G. Lias, Rhoda D. Levin, and Sherif A. Kafafi
Ionization energy determinations
IE (eV) | Method | Reference |
---|---|---|
13.0 ± 1.0 | EI | Farber and Srivastava, 1974 |

References

Chase, 1998
Chase, M.W., Jr.,
NIST-JANAF Themochemical Tables, Fourth Edition,
J. Phys. Chem. Ref. Data, Monograph 9, 1998, 1-1951. [all data]
Farber and Srivastava, 1974
Farber, M.; Srivastava, R.D.,
Dissociation energies of BeF and BeCl and the heat of formation of BeClF,
J. Chem. Soc. Faraday Trans. 1, 1974, 70, 1581. [all data]