Phosphoric triamide
- Formula: H6N3OP
- Molecular weight: 95.0409
- IUPAC Standard InChIKey: DMSZORWOGDLWGN-UHFFFAOYSA-N
- CAS Registry Number: 13597-72-3
- Chemical structure:
View 3d structure (requires JavaScript / HTML 5) - Permanent link for this species. Use this link for bookmarking this species for future reference.

Gas phase ion energetics data

Data compiled by: Sharon G. Lias, Rhoda D. Levin, and Sherif A. Kafafi
Ionization energy determinations
IE (eV) | Method | Reference |
---|---|---|
10.00 ± 0.05 | EI | Baldwin, Loudon, et al., 1977 |

References

Baldwin, Loudon, et al., 1977
Baldwin, M.A.; Loudon, A.G.; Webb, K.S.; Cardnell, P.C.,
Charge location and fragmentation under electron impact. V-The ionization potentials of (methylated) phosphoramides, guanidines, formamides, acetamides, ureas and thioureas,
Org. Mass Spectrom., 1977, 12, 279. [all data]