2-Naphthalenamine, N-phenyl-
- Formula: C16H13N
- Molecular weight: 219.2811
- IUPAC Standard InChIKey: KEQFTVQCIQJIQW-UHFFFAOYSA-N
- CAS Registry Number: 135-88-6
- Chemical structure:
View 3d structure (requires JavaScript / HTML 5) - Other names: 2-Naphthylamine, N-phenyl-; β-Naphthylphenylamine; Aceto PBN; AgeRite Powder; Antioxidant PBN; Antioxidant 116; N-(2-Naphthyl)aniline; N-Phenyl-β-naphthylamine; N-Phenyl-2-naphthylamine; Neosone D; Neozon D; Neozone; Neozone D; Nilox PBNA; Nonox D; Nonox DN; PBNA; Stabilizator AR; Vulkanox PBN; 2-Anilinonaphthalene; 2-Naphthylphenylamine; 2-Phenylaminonaphthalene; Anilinonaphthalene; NCI-C02915; Phenyl-β-naphthylamine; Phenyl-2-naphthylamine; N-Fenyl-2-aminonaftalen; Fenyl-β-naftylamin; N-Phenyl-2-naphthalenamine; N-(2-Naphthyl)-N-phenylamine; Stabilizer AR; Antioxidant D; Nocrac D; Naftam 2; N-β-Naphthyl-N-phenylamine; Stabilator AR; AK 1; AK 1 (stabilizer); NSC 37151; Noclizer D

Condensed phase thermochemistry data

Data compiled by: Hussein Y. Afeefy, Joel F. Liebman, and Stephen E. Stein
Quantity | Value | Units | Method | Reference | Comment |
---|---|---|---|---|---|
ΔfH°solid | 162. ± 1.7 | kJ/mol | Ccb | Medard and Thomas, 1954 | Heat of combustion corrected for pressure |
ΔfH°solid | 174.3 | kJ/mol | Ccb | Medard, 1954 | Heat of combustion corrected for pressure |
ΔfH°solid | 246. | kJ/mol | Ccb | Lemoult, 1906 | Author value for hf298-condensed=50.3 kcal/mol |
Quantity | Value | Units | Method | Reference | Comment |
ΔcH°solid | -8316.4 ± 1.7 | kJ/mol | Ccb | Medard and Thomas, 1954 | Heat of combustion corrected for pressure |
ΔcH°solid | -8328.46 | kJ/mol | Ccb | Medard, 1954 | Heat of combustion corrected for pressure |
ΔcH°solid | -8313.9 ± 1.8 | kJ/mol | Ccb | Roberts and Jessup, 1948 | |
ΔcH°solid | -8399.8 | kJ/mol | Ccb | Lemoult, 1906 | Author value for hf298-condensed=50.3 kcal/mol |

Phase change data

Data compiled as indicated in comments:
BS - Robert L. Brown and Stephen E. Stein
AC - William E. Acree, Jr., James S. Chickos
Quantity | Value | Units | Method | Reference | Comment |
---|---|---|---|---|---|
Tboil | 668.7 | K | N/A | Weast and Grasselli, 1989 | BS |
Enthalpy of vaporization
ΔvapH (kJ/mol) | Temperature (K) | Method | Reference | Comment |
---|---|---|---|---|
88.7 | 398. | A | Stephenson and Malanowski, 1987 | Based on data from 383. to 520. K.; AC |
Enthalpy of sublimation
ΔsubH (kJ/mol) | Temperature (K) | Method | Reference | Comment |
---|---|---|---|---|
115.8 | 348. | GS | Stephenson and Malanowski, 1987 | Based on data from 333. to 363. K. See also Fel'dshtein and Kuz'minskii, 1971.; AC |

Gas phase ion energetics data

Data compiled by: Henry M. Rosenstock, Keith Draxl, Bruce W. Steiner, and John T. Herron
Ionization energy determinations
IE (eV) | Method | Reference |
---|---|---|
7.15 | CTS | Kinoshita, 1962 |

Van Den Dool and Kratz RI, non-polar column, custom temperature program

Column type | Active phase | I | Reference | Comment |
---|---|---|---|---|
Capillary | 5 % Phenyl methyl siloxane | 2222. | Yasuhara, Shiraishi, et al., 1997 | 25. m/0.31 mm/0.52 μm, He; Program: 50C(2min) => (20C/min) => 120C => (7C/min) => 310C(10min) |

Normal alkane RI, non-polar column, temperature ramp

Column type | Active phase | I | Reference | Comment |
---|---|---|---|---|
Capillary | Ultra-1 | 2169. | Okumura, 1991 | 25. m/0.32 mm/0.25 μm, He, 3. K/min; Tstart: 80. C; Tend: 260. C |

References

Medard and Thomas, 1954
Medard, L.; Thomas, M.,
Chaleurs de combustion de vingt-quatre substances explosives ou apparentees a des explosifs,
Mem. Poudres, 1954, 36, 97-127. [all data]
Medard, 1954
Medard, L.,
Tables thermochimiques a l'usage des techniciens des substances explosives,
Mem. Artillerie Fr. Sci. Tech. Armement, 1954, 28, 415-492. [all data]
Lemoult, 1906
Lemoult, M.P.,
Thermochimie. - Chaleur de combustion et de formation de quelques composes cycliques azotes,
Compt. Rend., 1906, 143, 772-775. [all data]
Roberts and Jessup, 1948
Roberts, D.E.; Jessup, R.S.,
Heat of combustion of phenyl-beta-naphthylamine (N-phenyl-2-naphthylamine),
J. Res. NBS, 1948, 40, 281-283. [all data]
Weast and Grasselli, 1989
CRC Handbook of Data on Organic Compounds, 2nd Editon, Weast,R.C and Grasselli, J.G., ed(s)., CRC Press, Inc., Boca Raton, FL, 1989, 1. [all data]
Stephenson and Malanowski, 1987
Stephenson, Richard M.; Malanowski, Stanislaw,
Handbook of the Thermodynamics of Organic Compounds, 1987, https://doi.org/10.1007/978-94-009-3173-2
. [all data]
Fel'dshtein and Kuz'minskii, 1971
Fel'dshtein, L.S.; Kuz'minskii, A.S.,
Kauch. Rezina, 1971, 30, 11, 15. [all data]
Kinoshita, 1962
Kinoshita, M.,
The absorption spectra of the molecular complexes of aromatic compounds with p-bromanil,
Bull. Chem. Soc. Japan, 1962, 35, 1609. [all data]
Fihtengolts, et al., 1969
Fihtengolts, V.S., et al.,
Atlas of UV Absorption Spectra of Substances Used in Synthetic Rubber Manufacture, 1969, 66. [all data]
Yasuhara, Shiraishi, et al., 1997
Yasuhara, A.; Shiraishi, H.; Nishikawa, M.; Yamamoto, T.; Uehiro, T.; Nakasugi, O.; Okumura, T.; Kenmotsu, K.; Fukui, H.; Nagase, M.; Ono, Y.; Kawagoshi, Y.; Baba, K.; Noma, Y.,
Determination of organic components in leachates from hazardous waste disposal sites in Japan by gas chromatography-mass spectrometry,
J. Chromatogr. A, 1997, 774, 1-2, 321-332, https://doi.org/10.1016/S0021-9673(97)00078-2
. [all data]
Okumura, 1991
Okumura, T.,
retention indices of environmental chemicals on methyl silicone capillary column,
Journal of Environmental Chemistry (Japan), 1991, 1, 2, 333-358, https://doi.org/10.5985/jec.1.333
. [all data]