Hydroxyl-d
- Formula: DO
- Molecular weight: 18.0135
- IUPAC Standard InChIKey: TUJKJAMUKRIRHC-MICDWDOJSA-N
- CAS Registry Number: 13587-54-7
- Chemical structure:
View 3d structure (requires JavaScript / HTML 5) - Isotopologues:

Gas phase ion energetics data

Data compiled as indicated in comments:
LL - Sharon G. Lias and Joel F. Liebman
B - John E. Bartmess
Electron affinity determinations
EA (eV) | Method | Reference | Comment |
---|---|---|---|
1.825543 ± 0.000044 | LPD | Schulz, Mead, et al., 1982 | Given: 1.822549(37) eV. Derived acidity is for DOH -> DO- + H+; B |
1.825543 ± 0.000044 | LPD | Schulz, Mead, et al., 1982 | For D2O -> DO- + D+. BDE: 120.96±0.05 Qian, Song, et al., 2002 ΔSacid: 23.2; B |
1.8230 ± 0.0020 | LPD | Hotop, Patterson, et al., 1974 | B |
Ionization energy determinations
IE (eV) | Method | Reference | Comment |
---|---|---|---|
13.0290 ± 0.0002 | TE | Wiedmann, Tonkyn, et al., 1992 | LL |

Constants of diatomic molecules

Data compiled by: Klaus P. Huber and Gerhard H. Herzberg
Data collected through May, 1977
Symbol | Meaning |
---|---|
State | electronic state and / or symmetry symbol |
Te | minimum electronic energy (cm-1) |
ωe | vibrational constant – first term (cm-1) |
ωexe | vibrational constant – second term (cm-1) |
ωeye | vibrational constant – third term (cm-1) |
Be | rotational constant in equilibrium position (cm-1) |
αe | rotational constant – first term (cm-1) |
γe | rotation-vibration interaction constant (cm-1) |
De | centrifugal distortion constant (cm-1) |
βe | rotational constant – first term, centrifugal force (cm-1) |
re | internuclear distance (Å) |
Trans. | observed transition(s) corresponding to electronic state |
ν00 | position of 0-0 band (units noted in table) |
State | Te | ωe | ωexe | ωeye | Be | αe | γe | De | βe | re | Trans. | ν00 |
---|---|---|---|---|---|---|---|---|---|---|---|---|
C 2Σ+ | (89470) | (898) | (10) | [2.235] 1 | [2.053] | C → A 2 3 R | 56090.3 Z | |||||
↳Felenbok, 1963; missing citation | ||||||||||||
C 2Σ+ 4 | (C → X) 2 | (88568) | ||||||||||
↳missing citation | ||||||||||||
D 2Σ- | (82160) | (2074) | [8.2283] 5 | [5.179E-4] | [1.07018] | D ← X R | 81853.22 6 Z | |||||
↳Douglas, 1974 | ||||||||||||
B 2Σ+ | 69775 | [546.9] Z | 7 | [2.745] 8 | 9 | [2.50E-4] 10 | [1.8529] | B → A 11 R | 36275.7 Z | |||
↳Barrow, 1956; Herman, Felenbok, et al., 1961; missing citation; Czarny and Felenbok, 1968; missing citation | ||||||||||||
State | Te | ωe | ωexe | ωeye | Be | αe | γe | De | βe | re | Trans. | ν00 |
A 2Σ+ | 32680.85 12 | 2316.17 Z | 50.433 13 | -0.2350 | 9.1936 14 15 16 17 | 0.3181 18 | -0.00119 | [5.763E-4] 19 | 1.0124 | A ↔ X 20 21 R | 32477.18 6 Z | |
↳missing citation; Clyne, Coxon, et al., 1973; Coxon, 1975 | ||||||||||||
X 2Πi | 0 22 | 2720.24 Z | 44.055 | 10.0209 23 17 | 0.2757 24 | .0006 | [5.374E-4] 25 | 0.96975 26 | ||||
↳Dousmanis, Sanders, et al., 1955; Meerts and Dymanus, 1973; Meerts and Dymanus, 1975 | ||||||||||||
ESR sp. 27 | ||||||||||||
↳Carrington and Lucas, 1970 |

Gas phase thermochemistry data

Quantity | Value | Units | Method | Reference | Comment |
---|---|---|---|---|---|
ΔfH°gas | 36.60 | kJ/mol | Review | Chase, 1998 | Data last reviewed in June, 1977 |
Quantity | Value | Units | Method | Reference | Comment |
S°gas,1 bar | 189.65 | J/mol*K | Review | Chase, 1998 | Data last reviewed in June, 1977 |
Gas Phase Heat Capacity (Shomate Equation)
Cp° = A + B*t + C*t2 + D*t3 +
E/t2
H° − H°298.15= A*t + B*t2/2 +
C*t3/3 + D*t4/4 − E/t + F − H
S° = A*ln(t) + B*t + C*t2/2 + D*t3/3 −
E/(2*t2) + G
Cp = heat capacity (J/mol*K)
H° = standard enthalpy (kJ/mol)
S° = standard entropy (J/mol*K)
t = temperature (K) / 1000.
View plot Requires a JavaScript / HTML 5 canvas capable browser.
Temperature (K) | 298. to 1500. | 1500. to 6000. |
---|---|---|
A | 28.96935 | 34.24939 |
B | -3.657946 | 1.992422 |
C | 10.53573 | -0.305116 |
D | -3.749572 | 0.020965 |
E | 0.114832 | -4.534912 |
F | 28.42697 | 18.46985 |
G | 226.0126 | 222.3135 |
H | 36.60205 | 36.60205 |
Reference | Chase, 1998 | Chase, 1998 |
Comment | Data last reviewed in June, 1977 | Data last reviewed in June, 1977 |

References

Schulz, Mead, et al., 1982
Schulz, P.A.; Mead, R.D.; Jones, P.L.; Lineberger, W.C.,
OH- and OD- threshold photodetachment,
J. Chem. Phys., 1982, 77, 1153. [all data]
Qian, Song, et al., 2002
Qian, X.M.; Song, Y.; Lau, K.C.; Ng, C.Y.; Liu, J.B.; Chen, W.W.; He, G.Z.,
A pulsed field ionization photoelectron-photoion coincidence study of the dissociative photoionization process D2O+h nu - OD++D+e(-),
Chem. Phys. Lett., 2002, 353, 1-2, 19-26, https://doi.org/10.1016/S0009-2614(01)01442-7
. [all data]
Hotop, Patterson, et al., 1974
Hotop, H.; Patterson, T.A.; Lineberger, W.C.,
High resolution photodetachment study of OH- and OD- in the threshold region 7000-6450 Å,
J. Chem. Phys., 1974, 60, 1806. [all data]
Wiedmann, Tonkyn, et al., 1992
Wiedmann, R.T.; Tonkyn, R.G.; White, M.G.; Wang, K.; McKoy, V.,
Rotationally resolved threshold photoelectron spectra of OH and OD,
J. Chem. Phys., 1992, 97, 768. [all data]
Felenbok, 1963
Felenbok, P.,
Contribution a l'etude du spectre moleculaire des radicaux OH et OD,
Ann. Astrophys., 1963, 26, 393. [all data]
Douglas, 1974
Douglas, A.E.,
Absorption of OH in the 1200 Å region,
Can. J. Phys., 1974, 52, 318. [all data]
Barrow, 1956
Barrow, R.F.,
The B2Σ+-A2Σ+ band-systems of OH and OD,
Ark. Fys., 1956, 11, 281. [all data]
Herman, Felenbok, et al., 1961
Herman, L.; Felenbok, P.; Herman, R.,
Spectre d'emission des radicaux OH et OD,
J. Phys. Radium, 1961, 22, 83. [all data]
Czarny and Felenbok, 1968
Czarny, J.; Felenbok, P.,
Etude a tres haute resolution de la transition B2Σ+ → A2Σ+ de OH et OD a l'aide d'une source haute frequence mise au point a cet effet,
Ann. Astrophys., 1968, 31, 141. [all data]
Clyne, Coxon, et al., 1973
Clyne, M.A.A.; Coxon, J.A.; Woon Fat, A.R.,
The A2Σ+-X2Πi electronic band system of the OD free radical. Spectroscopic data for the 0-0 sequence, and rotational term values for A2Σ+ and X2Πi,
J. Mol. Spectrosc., 1973, 46, 146. [all data]
Coxon, 1975
Coxon, J.A.,
The A2Σ+-X2Πi system of OD. Determination of molecular constants by the direct two-state fit approach,
J. Mol. Spectrosc., 1975, 58, 1. [all data]
Dousmanis, Sanders, et al., 1955
Dousmanis, G.C.; Sanders, T.M., Jr.; Townes, C.H.,
Microwave spectra of the free radicals OH and OD,
Phys. Rev., 1955, 100, 1735. [all data]
Meerts and Dymanus, 1973
Meerts, W.L.; Dymanus, A.,
Accurate frequencies below 5 GHz of the lower J states of OD,
Astrophys. J., 1973, 180, 93. [all data]
Meerts and Dymanus, 1975
Meerts, W.L.; Dymanus, A.,
A molecular beam electric resonance study of the hyperfine Λ doubling spectrum of OH, OD, SH, and SD,
Can. J. Phys., 1975, 53, 2123. [all data]
Carrington and Lucas, 1970
Carrington, A.; Lucas, J.D.,
Electron resonance of gaseous diatomic hydrides. I. 17O hyperfine and quadrupole interactions in OH and OD,
Proc. R. Soc. London A, 1970, 314, 567. [all data]
Smith and Stella, 1975
Smith, Wm.H.; Stella, G.,
Lifetimes for OH and OD electronic states with resonance transitions in the region between 1700 and 1950 Å,
J. Chem. Phys., 1975, 63, 2395. [all data]
Carlone and Dalby, 1969
Carlone, C.; Dalby, F.W.,
Spectrum of the hydroxyl radical,
Can. J. Phys., 1969, 47, 1945. [all data]
Broida and Kane, 1953
Broida, H.P.; Kane, W.R.,
Rotational intensity distributions of OH and OD in an electrodeless discharge through water vapor,
Phys. Rev., 1953, 89, 1053. [all data]
Palmer and Naegeli, 1968
Palmer, H.B.; Naegeli, D.W.,
Predissociation of chemiluminescent OH and OD,
J. Mol. Spectrosc., 1968, 28, 417-421. [all data]
Elmergreen and Smith, 1972
Elmergreen, B.G.; Smith, W.H.,
Direct measurement of the lifetimes and predissociation probabilities for rotational levels of the OH and OD A2Σ+ states,
Astrophys. J., 1972, 178, 557. [all data]
Wilcox, Anderson, et al., 1975
Wilcox, D.; Anderson, R.; Peacher, J.,
Rotational and predissociation lifetimes of the A2Σ+ state of OD,
J. Opt. Soc. Am., 1975, 65, 1368. [all data]
Czarny, Felenbok, et al., 1971
Czarny, J.; Felenbok, P.; Lefebvre-Brion, H.,
High vibrational level predissociation in the A2Σ+ state of OD,
J. Phys. B:, 1971, 4, 124. [all data]
Carlone, 1974
Carlone, C.,
Asymmetric line shapes in the B → A system of OD,
Phys. Rev. A: Gen. Phys., 1974, 9, 606. [all data]
Carlone, 1975
Carlone, C.,
Interference effects in the excitation of resonances with fine structure - an application to the predissociation in the B → A system of the deutroxyl radical,
Phys. Rev. A: Gen. Phys., 1975, 12, 2464. [all data]
Scarl and Dalby, 1971
Scarl, E.A.; Dalby, F.W.,
High-field Stark effects on the near ultraviolet spectrum of the hydroxyl radical,
Can. J. Phys., 1971, 49, 2825. [all data]
Weinstock and Zare, 1973
Weinstock, E.M.; Zare, R.N.,
High-field level-crossing and Stark studies of the A2Σ+ state of OD,
J. Chem. Phys., 1973, 58, 4319. [all data]
Woods and Dixon, 1976
Woods, R.C.; Dixon, T.A.,
Comment on the quadrupole coupling constants in the A2Σ+ states of OD and NO,
J. Chem. Phys., 1976, 64, 5319. [all data]
German, 1976
German, K.R.,
High field level crossing measurements of tha A2Σ+ state of OD,
J. Chem. Phys., 1976, 64, 4192. [all data]
German, 1975
German, K.R.,
Direct measurement of the radiative lifetimes of the A2Σ+ (V' = 0) states of OH and OD,
J. Chem. Phys., 1975, 62, 2584. [all data]
Becker and Haaks, 1973
Becker, K.H.; Haaks, D.,
Measurement of the natural lifetimes and quenching rate constants of OH(2Σ+, v = 0,1) and OD(2Σ+, v = 0,1) radicals,
Z. Naturforsch. A, 1973, 28, 249. [all data]
Brophy, Silver, et al., 1974
Brophy, J.H.; Silver, J.A.; Kinsey, J.L.,
Direct measurement of the radiative lifetime of the A2Σ+(v' = 0, K' = 1, J' = 3/2) state of OH and OD,
Chem. Phys. Lett., 1974, 28, 418. [all data]
de Zafra, Marshall, et al., 1971
de Zafra, R.L.; Marshall, A.; Metcalf, H.,
Measurement of lifetime and g factors by level crossing and optical double resonance in the OH and OD free radicals,
Phys. Rev. A: Gen. Phys., 1971, 3, 1557. [all data]
German, Bergeman, et al., 1973
German, K.R.; Bergeman, T.H.; Weinstock, E.M.; Zare, R.N.,
Zero-field level crossing and optical radio-frequency double resonance studies of the A2Σ+ states of OH and OD,
J. Chem. Phys., 1973, 58, 4304. [all data]
Rouse and Engleman, 1973
Rouse, P.E.; Engleman, R., Jr.,
Oscillator strengths from line absorption in a high-temperature furnace. I. The (0,0) and (1,0) bands of the A2Σ+-X2Πi transition in OH and OD,
J. Quant. Spectrosc. Radiat. Transfer, 1973, 13, 1503. [all data]
Thakur, Rai, et al., 1968
Thakur, S.N.; Rai, D.K.; Singh, N.L.,
Zeeman effect in the (0, 0) band of OD,
J. Chem. Phys., 1968, 48, 3389. [all data]
Nanes and Robinson, 1971
Nanes, R.; Robinson, D.W.,
Magnetic rotation spectra of the A2Σ+-X2Πi transition of OH and OD,
J. Chem. Phys., 1971, 55, 963. [all data]
Tinti, 1968
Tinti, D.S.,
Absorption and emission spectra of OH and OD in solid Ne. Evidence for rotation,
J. Chem. Phys., 1968, 48, 1459. [all data]
Crosley and Lengel, 1977
Crosley, D.R.; Lengel, R.K.,
Relative transition probabilities in the A-X system of OD,
J. Quant. Spectrosc. Radiat. Transfer, 1977, 17, 59. [all data]
Coxon and Hammersley, 1975
Coxon, J.A.; Hammersley, R.E.,
Spin-orbit coupling and Λ-type doubling in the ground state of OD, X2Π. Comparison of experimental constants with ab initio calculations,
J. Mol. Spectrosc., 1975, 58, 29. [all data]
Katsumata and Lloyd, 1977
Katsumata, S.; Lloyd, D.R.,
The photoelectron spectra of the OH and OD radicals,
Chem. Phys. Lett., 1977, 45, 519. [all data]
Meerts and Dymanus, 1973, 2
Meerts, W.L.; Dymanus, A.,
Electric dipole moments of OH and OD by molecular beam electric resonance,
Chem. Phys. Lett., 1973, 23, 45. [all data]