Ammonia-d1

Gas phase ion energetics data

Data compiled as indicated in comments:
LL - Sharon G. Lias and Joel F. Liebman
LLK - Sharon G. Lias, Rhoda D. Levin, and Sherif A. Kafafi

Ionization energy determinations

IE (eV) Method Reference Comment
10.072 ± 0.010PILocht, Leyh, et al., 1991LL

Appearance energy determinations

Ion AE (eV) Other Products MethodReferenceComment
HDN+15.79 ± 0.01HPIMcCulloh, 1976LLK

References

Locht, Leyh, et al., 1991
Locht, R.; Leyh, B.; Denzer, W.; Hagenow, G.; Baumgartel, H., The photoionization of ammonia revisited. The vibrational autoionization of NH3 and its three isotopomers in the 10-12 eV photon energy range, Chem. Phys., 1991, 155, 407. [all data]

McCulloh, 1976
McCulloh, K.E., Energetics and mechanisms of fragment ion formation in the photoionization of normal and deuterated water and ammonia, Int. J. Mass Spectrom. Ion Phys., 1976, 21, 333. [all data]