GeCl3
- Formula: Cl3Ge
- Molecular weight: 179.00
- CAS Registry Number: 13569-55-6

Vibrational and/or electronic energy levels

Data compiled by: Marilyn E. Jacox
State: X
Vib. sym. |
No. | Approximate type of mode |
cm-1 | Med. | Method | References | |
---|---|---|---|---|---|---|---|
e | 3 | GeCl3 stretch | 420 | Ar | IR | Miller and Andrews, 1981 | |
Additional references: Jacox, 1994, page 219

References

Miller and Andrews, 1981
Miller, J.H.; Andrews, L.,
Matrix spectroscopy of the argon resonance photolysis products of group IV chlorides,
J. Mol. Struct., 1981, 77, 1-2, 65, https://doi.org/10.1016/0022-2860(81)85267-2
. [all data]
Jacox, 1994
Jacox, M.E.,
Vibrational and electronic energy levels of polyatomic transient molecules, American Chemical Society, Washington, DC, 1994, 464. [all data]