Bromogermane
- Formula: BrGeH3
- Molecular weight: 155.57
- IUPAC Standard InChIKey: ADCYJWLRSGVKRH-UHFFFAOYSA-N
- CAS Registry Number: 13569-43-2
- Chemical structure:
View 3d structure (requires JavaScript / HTML 5) - Permanent link for this species. Use this link for bookmarking this species for future reference.

Gas phase ion energetics data

Data compiled by: Sharon G. Lias, Rhoda D. Levin, and Sherif A. Kafafi
Ionization energy determinations
IE (eV) | Method | Reference | Comment |
---|---|---|---|
10.72 ± 0.05 | PE | Cradock and Ebsworth, 1971 | Vertical value |

Vibrational and/or electronic energy levels

Data compiled by: Takehiko Shimanouchi
Symmetry: C3ν Symmetry Number σ = 3
Sym. | No | Approximate | Selected Freq. | Infrared | Raman | Comments | ||||
---|---|---|---|---|---|---|---|---|---|---|
Species | type of mode | Value | Rating | Value | Phase | Value | Phase | |||
a1 | 1 | GeH3 s-str | 2115 | C | 2115.2 | gas | ||||
a1 | 2 | GeH3 s-deform | 833 | C | 832.7 | gas | ||||
a1 | 3 | GeBr str | 308 | C | 307.7 | gas | ||||
e | 4 | GeH3 d-str | 2127 | B | 2126.7 | gas | ||||
e | 5 | GeH3 d-deform | 871 | B | 870.9 | gas | ||||
e | 6 | GeH3 rock | 578 | B | 578.2 | gas | ||||
Source: Shimanouchi, 1972

References

Cradock and Ebsworth, 1971
Cradock, S.; Ebsworth, E.A.V.,
Photo-electron spectra of silyl and germyl halides (p→d)π-bonding,
Chem. Commun., 1971, 57. [all data]
Shimanouchi, 1972
Shimanouchi, T.,
Tables of Molecular Vibrational Frequencies Consolidated Volume II,
J. Phys. Chem. Ref. Data, 1972, 6, 3, 993-1102. [all data]