Strontium monofluoride
- Formula: FSr
- Molecular weight: 106.62
- IUPAC Standard InChIKey: GXLMLAGMLTWIOF-UHFFFAOYSA-M
- CAS Registry Number: 13569-27-2
- Chemical structure:
View 3d structure (requires JavaScript / HTML 5) - Permanent link for this species. Use this link for bookmarking this species for future reference.

Gas phase thermochemistry data

Quantity | Value | Units | Method | Reference | Comment |
---|---|---|---|---|---|
ΔfH°gas | -294.55 | kJ/mol | Review | Chase, 1998 | Data last reviewed in December, 1972 |
Quantity | Value | Units | Method | Reference | Comment |
S°gas,1 bar | 239.92 | J/mol*K | Review | Chase, 1998 | Data last reviewed in December, 1972 |
Gas Phase Heat Capacity (Shomate Equation)
Cp° = A + B*t + C*t2 + D*t3 +
E/t2
H° − H°298.15= A*t + B*t2/2 +
C*t3/3 + D*t4/4 − E/t + F − H
S° = A*ln(t) + B*t + C*t2/2 + D*t3/3 −
E/(2*t2) + G
Cp = heat capacity (J/mol*K)
H° = standard enthalpy (kJ/mol)
S° = standard entropy (J/mol*K)
t = temperature (K) / 1000.
View plot Requires a JavaScript / HTML 5 canvas capable browser.
Temperature (K) | 298. to 1500. | 1500. to 6000. |
---|---|---|
A | 35.57312 | 48.01809 |
B | 4.411903 | -7.962696 |
C | -3.128834 | 2.185056 |
D | 0.845486 | -0.137239 |
E | -0.191361 | -5.955506 |
F | -305.9726 | -319.2974 |
G | 280.7071 | 288.0688 |
H | -294.5544 | -294.5544 |
Reference | Chase, 1998 | Chase, 1998 |
Comment | Data last reviewed in December, 1972 | Data last reviewed in December, 1972 |

Gas phase ion energetics data

Data compiled as indicated in comments:
LL - Sharon G. Lias and Joel F. Liebman
RDSH - Henry M. Rosenstock, Keith Draxl, Bruce W. Steiner, and John T. Herron
Ionization energy determinations
IE (eV) | Method | Reference | Comment |
---|---|---|---|
5.21 ± 0.06 | EVAL | Belyaev, Gotkis, et al., 1990 | LL |
5.0 ± 0.3 | EI | Hildenbrand, 1968 | RDSH |
4.9 ± 0.3 | EI | Green, Blue, et al., 1964 | RDSH |
5.2 ± 0.3 | EI | Ehlert, Blue, et al., 1964 | RDSH |

References

Chase, 1998
Chase, M.W., Jr.,
NIST-JANAF Themochemical Tables, Fourth Edition,
J. Phys. Chem. Ref. Data, Monograph 9, 1998, 1-1951. [all data]
Belyaev, Gotkis, et al., 1990
Belyaev, V.N.; Gotkis, I.S.; Lebedeva, N.L.; Krasnov, K.S.,
Ionization potentials of MX molecules (M = Ca, Sr, Ba; X = F, Cl, Br, I, OH, O),
Russ. J. Phys. Chem., 1990, 64, 773. [all data]
Hildenbrand, 1968
Hildenbrand, D.L.,
Mass-spectrometric studies of bonding in the group IIA fluorides,
J. Chem. Phys., 1968, 48, 3657. [all data]
Green, Blue, et al., 1964
Green, J.W.; Blue, G.D.; Ehlert, T.C.; Margrave, J.L.,
Mass spectrometric studies at high temperatures. III. The sublimation pressures of magnesium, strontium, and barium fluorides,
J. Chem. Phys., 1964, 41, 2245. [all data]
Ehlert, Blue, et al., 1964
Ehlert, T.C.; Blue, G.D.; Green, J.W.; Margrave, J.L.,
Mass spectrometric studies at high temperatures. IV. Dissociation energies of the alkaline earth monofluorides,
J. Chem. Phys., 1964, 41, 2250. [all data]