Phosphorus dibromide chloride
- Formula: Br2ClP
- Molecular weight: 226.235
- IUPAC Standard InChIKey: GGPXFGIDBKRALQ-UHFFFAOYSA-N
- CAS Registry Number: 13550-32-8
- Chemical structure:
View 3d structure (requires JavaScript / HTML 5) - Permanent link for this species. Use this link for bookmarking this species for future reference.

Gas phase ion energetics data

Data compiled as indicated in comments:
LLK - Sharon G. Lias, Rhoda D. Levin, and Sherif A. Kafafi
B - John E. Bartmess
Electron affinity determinations
EA (eV) | Method | Reference | Comment |
---|---|---|---|
1.63 ± 0.20 | NBIE | Mathur, Rothe, et al., 1976 | B |
Ionization energy determinations
IE (eV) | Method | Reference | Comment |
---|---|---|---|
10.2 ± 0.1 | EI | Varmuza and Krenmayr, 1971 | LLK |
Appearance energy determinations
Ion | AE (eV) | Other Products | Method | Reference | Comment |
---|---|---|---|---|---|
PClBr+ | 11.3 ± 0.1 | Br | EI | Varmuza and Krenmayr, 1971 | LLK |

References

Mathur, Rothe, et al., 1976
Mathur, B.P.; Rothe, E.W.; Tang, S.Y.; Reck, G.,
Negative ions from phosphorus halides due to cesium charge exchange,
J. Chem. Phys., 1976, 64, 565. [all data]
Varmuza and Krenmayr, 1971
Varmuza, K.; Krenmayr, P.,
Massenspektrometrische untersuchungen einfacher und gemischter phosphortrihalogenide,
Monatsh. Chem., 1971, 102, 1037. [all data]