1-Pentyn-3-one, 4-methyl-
- Formula: C6H8O
- Molecular weight: 96.1271
- IUPAC Standard InChIKey: KLQCAVMGXXCQHN-UHFFFAOYSA-N
- CAS Registry Number: 13531-82-3
- Chemical structure:
View 3d structure (requires JavaScript / HTML 5) - Permanent link for this species. Use this link for bookmarking this species for future reference.

Gas phase ion energetics data

Data compiled by: Sharon G. Lias, Rhoda D. Levin, and Sherif A. Kafafi
Ionization energy determinations
IE (eV) | Method | Reference | Comment |
---|---|---|---|
9.89 | PE | Carlier and Mouvier, 1979 | Vertical value |

References

Carlier and Mouvier, 1979
Carlier, P.; Mouvier, G.,
Etude par spectrometrie de photoelectrons de la structure electronique des ynals et des ynones conjugues,
J. Electron Spectrosc. Relat. Phenom., 1979, 17, 169. [all data]