Boron triiodide
- Formula: BI3
- Molecular weight: 391.524
- IUPAC Standard InChIKey: YMEKEHSRPZAOGO-UHFFFAOYSA-N
- CAS Registry Number: 13517-10-7
- Chemical structure:
View 3d structure (requires JavaScript / HTML 5) - Other names: BI3; Borane, triiodo-; Triiodoborane

Gas phase thermochemistry data

Quantity | Value | Units | Method | Reference | Comment |
---|---|---|---|---|---|
ΔfH°gas | 71.13 | kJ/mol | Review | Chase, 1998 | Data last reviewed in December, 1964 |
Quantity | Value | Units | Method | Reference | Comment |
S°gas,1 bar | 348.64 | J/mol*K | Review | Chase, 1998 | Data last reviewed in December, 1964 |
Gas Phase Heat Capacity (Shomate Equation)
Cp° = A + B*t + C*t2 + D*t3 +
E/t2
H° − H°298.15= A*t + B*t2/2 +
C*t3/3 + D*t4/4 − E/t + F − H
S° = A*ln(t) + B*t + C*t2/2 + D*t3/3 −
E/(2*t2) + G
Cp = heat capacity (J/mol*K)
H° = standard enthalpy (kJ/mol)
S° = standard entropy (J/mol*K)
t = temperature (K) / 1000.
View plot Requires a JavaScript / HTML 5 canvas capable browser.
Temperature (K) | 298. to 6000. |
---|---|
A | 80.75706 |
B | 2.015451 |
C | -0.542836 |
D | 0.046149 |
E | -0.967621 |
F | 43.72154 |
G | 440.3493 |
H | 71.12800 |
Reference | Chase, 1998 |
Comment | Data last reviewed in December, 1964 |

Gas phase ion energetics data

Data compiled as indicated in comments:
LLK - Sharon G. Lias, Rhoda D. Levin, and Sherif A. Kafafi
RDSH - Henry M. Rosenstock, Keith Draxl, Bruce W. Steiner, and John T. Herron
Ionization energy determinations
IE (eV) | Method | Reference | Comment |
---|---|---|---|
9.25 ± 0.03 | PE | Bassett and Lloyd, 1971 | LLK |
Appearance energy determinations
Ion | AE (eV) | Other Products | Method | Reference | Comment |
---|---|---|---|---|---|
B+ | 16.6 ± 0.5 | ? | EI | Koski, Kaufman, et al., 1959 | RDSH |
BI+ | 14.4 ± 0.2 | ? | EI | Koski, Kaufman, et al., 1959 | RDSH |
BI2+ | 9.7 ± 0.2 | I | EI | Koski, Kaufman, et al., 1959 | RDSH |

References

Chase, 1998
Chase, M.W., Jr.,
NIST-JANAF Themochemical Tables, Fourth Edition,
J. Phys. Chem. Ref. Data, Monograph 9, 1998, 1-1951. [all data]
Bassett and Lloyd, 1971
Bassett, P.J.; Lloyd, D.R.,
Photoelectron spectra of halides. Part II.High-resolution spectra of the boron trihalides,
J. Chem. Soc., 1971, (A), 1551. [all data]
Koski, Kaufman, et al., 1959
Koski, W.S.; Kaufman, J.J.; Pachucki, C.F.,
A mass spectroscopic appearance potential study of some boron trihalides,
J. Am. Chem. Soc., 1959, 81, 1326. [all data]