Carbonic acid, methyl phenyl ester
- Formula: C8H8O3
- Molecular weight: 152.1473
- IUPAC Standard InChIKey: XTBFPVLHGVYOQH-UHFFFAOYSA-N
- CAS Registry Number: 13509-27-8
- Chemical structure:
View 3d structure (requires JavaScript / HTML 5) - Other names: Methyl phenyl carbonate; Phenyl methyl carbonate

Gas phase ion energetics data

Data compiled by: Henry M. Rosenstock, Keith Draxl, Bruce W. Steiner, and John T. Herron
Appearance energy determinations
Ion | AE (eV) | Other Products | Method | Reference | Comment |
---|---|---|---|---|---|
C7H8O+ | 10.3 | CO2 | EI | Williams, Cooks, et al., 1968 |

References

Williams, Cooks, et al., 1968
Williams, D.H.; Cooks, R.G.; Howe, I.,
Studies in mass spectrometry. XXXI. A comparison of reaction rates in common ions generated via fragmentation and direct ionization,
J. Am. Chem. Soc., 1968, 90, 6759. [all data]