Methanone, phenyl-2-thienyl-
- Formula: C11H8OS
- Molecular weight: 188.246
- IUPAC Standard InChIKey: DWYFUJJWTRPARQ-UHFFFAOYSA-N
- CAS Registry Number: 135-00-2
- Chemical structure:
View 3d structure (requires JavaScript / HTML 5) - Other names: Ketone, phenyl 2-thienyl; α-Benzoylthiophene; Phenyl 2-thienyl ketone; 2-Benzoylthiophene; 2-Thienyl phenyl ketone

Phase change data

Data compiled by: Robert L. Brown and Stephen E. Stein
Quantity | Value | Units | Method | Reference | Comment |
---|---|---|---|---|---|
Tboil | 573.2 | K | N/A | Weast and Grasselli, 1989 | |
Tboil | 573. | K | N/A | Buckingham and Donaghy, 1982 | |
Quantity | Value | Units | Method | Reference | Comment |
Tfus | 329.6 to 330. | K | N/A | Buckingham and Donaghy, 1982 |
Reduced pressure boiling point
Tboil (K) | Pressure (bar) | Reference |
---|---|---|
414. to 415. | 0.004 | Buckingham and Donaghy, 1982 |

Gas phase ion energetics data

Data compiled by: Sharon G. Lias, Rhoda D. Levin, and Sherif A. Kafafi
Ionization energy determinations
IE (eV) | Method | Reference |
---|---|---|
9.2 ± 0.1 | EI | Grutzmacher and Schubert, 1979 |
Appearance energy determinations
Ion | AE (eV) | Other Products | Method | Reference | Comment |
---|---|---|---|---|---|
C5H3OS+ | 11.8 ± 0.1 | C6H5 | EI | Grutzmacher and Schubert, 1979 | |
C7H5O+ | 12.0 ± 0.1 | C4H3S | EI | Grutzmacher and Schubert, 1979 |

References

Weast and Grasselli, 1989
CRC Handbook of Data on Organic Compounds, 2nd Editon, Weast,R.C and Grasselli, J.G., ed(s)., CRC Press, Inc., Boca Raton, FL, 1989, 1. [all data]
Buckingham and Donaghy, 1982
Buckingham, J.; Donaghy, S.M.,
Dictionary of Organic Compounds: Fifth Edition, Chapman and Hall, New York, 1982, 1. [all data]
Grutzmacher and Schubert, 1979
Grutzmacher, H.-F.; Schubert, R.,
Substituent effects in the mass spectra of benzoyl hetarenes,
Org. Mass Spectrom., 1979, 14, 567. [all data]
Arnold and Birtwell, 1973
Arnold, D.R.; Birtwell, R.J.,
J. Am. Chem. Soc., 1973, 95, 4599. [all data]