Methanone, (4-chlorophenyl)phenyl-
- Formula: C13H9ClO
- Molecular weight: 216.663
- IUPAC Standard InChIKey: UGVRJVHOJNYEHR-UHFFFAOYSA-N
- CAS Registry Number: 134-85-0
- Chemical structure:
View 3d structure (requires JavaScript / HTML 5) - Other names: Benzophenone, 4-chloro-; p-Chlorobenzophenone; p-CBP; 4-Chlorobenzophenone; p-Chlorophenyl phenyl ketone; Hydroxyzine (chloro-benzophenone); Meclizine M (chloro-benzophenone); Etodroxine M (chloro-benzophenone); Buclizine M (Chlorobenzophenone)

Gas phase ion energetics data

Data compiled as indicated in comments:
LLK - Sharon G. Lias, Rhoda D. Levin, and Sherif A. Kafafi
RDSH - Henry M. Rosenstock, Keith Draxl, Bruce W. Steiner, and John T. Herron
B - John E. Bartmess
Electron affinity determinations
EA (eV) | Method | Reference | Comment |
---|---|---|---|
0.833 ± 0.048 | IMRE | Fukuda and McIver, 1985 | ΔGea(355 K) = -20.4 kcal/mol; ΔSea = 3.5, est. from data in Kebarle and Chowdhury, 1987; B |
0.859 ± 0.087 | IMRE | Huh, Kang, et al., 1999 | ΔG(EA) 343K; anchored to ΔG value. Including anchor ΔS, EA is ca. 0.4 kcal/mol more bound.; B |
Ionization energy determinations
IE (eV) | Method | Reference | Comment |
---|---|---|---|
9.6 ± 0.1 | EI | Heller, Varmuza, et al., 1974 | LLK |
9.68 ± 0.01 | EI | Foffani, Pignataro, et al., 1964 | RDSH |
Appearance energy determinations
Ion | AE (eV) | Other Products | Method | Reference | Comment |
---|---|---|---|---|---|
C6H4Cl+ | 15.7 ± 0.3 | ? | EI | Krenmayr, Heller, et al., 1974 | LLK |
C6H5+ | 15.2 ± 0.3 | ? | EI | Krenmayr, Heller, et al., 1974 | LLK |
C7H4OCl+ | 11.7 ± 0.2 | C6H5 | EI | Heller, Varmuza, et al., 1974 | LLK |
C7H5O+ | 11.5 ± 0.1 | ? | EI | Krenmayr, Heller, et al., 1974 | LLK |
C13H9O+ | 11.1 ± 0.2 | ? | EI | Krenmayr, Heller, et al., 1974 | LLK |

Phase change data

Data compiled as indicated in comments:
BS - Robert L. Brown and Stephen E. Stein
AC - William E. Acree, Jr., James S. Chickos
Quantity | Value | Units | Method | Reference | Comment |
---|---|---|---|---|---|
ΔsubH° | 25.86 ± 0.07 | kcal/mol | ME | Ribeiro da Silva, Amaral, et al., 2007 | Based on data from 320. to 338. K.; AC |
Reduced pressure boiling point
Tboil (K) | Pressure (atm) | Reference | Comment |
---|---|---|---|
468.7 | 0.022 | Aldrich Chemical Company Inc., 1990 | BS |
Enthalpy of sublimation
ΔsubH (kcal/mol) | Temperature (K) | Method | Reference | Comment |
---|---|---|---|---|
25.19 ± 0.07 | 329. | ME | Ribeiro da Silva, Amaral, et al., 2007 | Based on data from 320. to 338. K.; AC |

Normal alkane RI, non-polar column, temperature ramp

Data compiled by: NIST Mass Spectrometry Data Center, William E. Wallace, director

Column type CapillaryCapillaryCapillaryCapillary
Active phase HP-1HP-1HP-1HP-1
Column length (m) 12.12.12.12.
Carrier gas HeHeHeHe
Substrate
Column diameter (mm) 0.200.200.200.20
Phase thickness (μm) 0.330.330.330.33
Tstart (C) 100.100.100.100.
Tend (C) 310.310.310.310.
Heat rate (K/min) 30.30.30.30.
Initial hold (min) 3.3.3.3.
Final hold (min) 5.5.5.5.
I 1850.1850.1850.1850.
ReferenceMaurer and Pfleger, 1988Maurer and Pfleger, 1988Maurer and Pfleger, 1988Maurer and Pfleger, 1988
Comment MSDC-RI MSDC-RI MSDC-RI MSDC-RI

References

Fukuda and McIver, 1985
Fukuda, E.K.; McIver, R.T., Jr.,
Relative electron affinities of substituted benzophenones, nitrobenzenes, and quinones. [Anchored to EA(SO2) from 74CEL/BEN],
J. Am. Chem. Soc., 1985, 107, 2291. [all data]
Kebarle and Chowdhury, 1987
Kebarle, P.; Chowdhury, S.,
Electron affinities and electron transfer reactions,
Chem. Rev., 1987, 87, 513. [all data]
Huh, Kang, et al., 1999
Huh, C.; Kang, C.H.; Lee, H.W.; Nakamura, H.; Mishima, M.; Tsuno, Y.; Yamataka, H.,
Thermodynamic stabilities and resonance demand of aromatic radical anions in the gas phase,
Bull. Chem. Soc. Japan, 1999, 72, 5, 1083-1091, https://doi.org/10.1246/bcsj.72.1083
. [all data]
Heller, Varmuza, et al., 1974
Heller, R.; Varmuza, K.; Krenmayr, P.,
Massenspektrometrische untersuchung des substituenteneffektes bei einfach substituierten benzophenonen,
Monatsh. Chem., 1974, 105, 787. [all data]
Foffani, Pignataro, et al., 1964
Foffani, A.; Pignataro, S.; Cantone, B.; Grasso, F.,
Ionization potentials and substituent effects for aromatic carbonyl compounds,
Z. Physik. Chem. (Frankfurt), 1964, 42, 221. [all data]
Krenmayr, Heller, et al., 1974
Krenmayr, P.; Heller, R.; Varmuza, K.,
Massenspektrometrische untersuchungen an benzophenon und substituierten benzophenonen. I. Ermittlung thermodynamischer grossen,
Org. Mass Spectrom., 1974, 9, 998. [all data]