Tungsten pentabromide
- Formula: Br5W
- Molecular weight: 583.36
- CAS Registry Number: 13470-11-6

Condensed phase thermochemistry data

Quantity | Value | Units | Method | Reference | Comment |
---|---|---|---|---|---|
ΔfH°liquid | -298.06 | kJ/mol | Review | Chase, 1998 | Data last reviewed in June, 1967 |
Quantity | Value | Units | Method | Reference | Comment |
S°liquid,1 bar | 293.34 | J/mol*K | Review | Chase, 1998 | Data last reviewed in June, 1967 |
Quantity | Value | Units | Method | Reference | Comment |
ΔfH°solid | -311.71 | kJ/mol | Review | Chase, 1998 | Data last reviewed in June, 1967 |
Quantity | Value | Units | Method | Reference | Comment |
S°solid | 271.95 | J/mol*K | Review | Chase, 1998 | Data last reviewed in June, 1967 |
Liquid Phase Heat Capacity (Shomate Equation)
Cp° = A + B*t + C*t2 + D*t3 +
E/t2
H° − H°298.15= A*t + B*t2/2 +
C*t3/3 + D*t4/4 − E/t + F − H
S° = A*ln(t) + B*t + C*t2/2 + D*t3/3 −
E/(2*t2) + G
Cp = heat capacity (J/mol*K)
H° = standard enthalpy (kJ/mol)
S° = standard entropy (J/mol*K)
t = temperature (K) / 1000.
View plot Requires a JavaScript / HTML 5 canvas capable browser.
Temperature (K) | 559. to 1000. |
---|---|
A | 182.0040 |
B | 0.000000 |
C | 0.000000 |
D | 0.000000 |
E | 0.000000 |
F | -352.3238 |
G | 513.5944 |
H | -298.0594 |
Reference | Chase, 1998 |
Comment | Data last reviewed in June, 1967 |
Solid Phase Heat Capacity (Shomate Equation)
Cp° = A + B*t + C*t2 + D*t3 +
E/t2
H° − H°298.15= A*t + B*t2/2 +
C*t3/3 + D*t4/4 − E/t + F − H
S° = A*ln(t) + B*t + C*t2/2 + D*t3/3 −
E/(2*t2) + G
Cp = heat capacity (J/mol*K)
H° = standard enthalpy (kJ/mol)
S° = standard entropy (J/mol*K)
t = temperature (K) / 1000.
View plot Requires a JavaScript / HTML 5 canvas capable browser.
Temperature (K) | 298. to 559. |
---|---|
A | 119.7394 |
B | 122.0711 |
C | -27.88958 |
D | 11.90114 |
E | 0.132360 |
F | -352.1719 |
G | 382.3385 |
H | -311.7084 |
Reference | Chase, 1998 |
Comment | Data last reviewed in June, 1967 |

Gas phase ion energetics data

Data compiled as indicated in comments:
LLK - Sharon G. Lias, Rhoda D. Levin, and Sherif A. Kafafi
Ionization energy determinations
IE (eV) | Method | Reference | Comment |
---|---|---|---|
8.3 ± 0.2 | EI | Kaposi, Popovic, et al., 1977 | LLK |
Appearance energy determinations
Ion | AE (eV) | Other Products | Method | Reference | Comment |
---|---|---|---|---|---|
BrW+ | 20.9 ± 0.3 | 4Br | EI | Kaposi, Popovic, et al., 1977 | LLK |
Br2W+ | 16.6 ± 0.2 | 3Br | EI | Kaposi, Popovic, et al., 1977 | LLK |
Br3W+ | 13.4 ± 0.2 | 2Br | EI | Kaposi, Popovic, et al., 1977 | LLK |
Br4W+ | 10.0 ± 0.2 | Br | EI | Kaposi, Popovic, et al., 1977 | LLK |
W+ | 25.0 ± 0.3 | 5Br | EI | Kaposi, Popovic, et al., 1977 | LLK |

Gas phase thermochemistry data

Quantity | Value | Units | Method | Reference | Comment |
---|---|---|---|---|---|
ΔfH°gas | -199.16 | kJ/mol | Review | Chase, 1998 | Data last reviewed in June, 1967 |
Quantity | Value | Units | Method | Reference | Comment |
S°gas,1 bar | 461.47 | J/mol*K | Review | Chase, 1998 | Data last reviewed in June, 1967 |
Gas Phase Heat Capacity (Shomate Equation)
Cp° = A + B*t + C*t2 + D*t3 +
E/t2
H° − H°298.15= A*t + B*t2/2 +
C*t3/3 + D*t4/4 − E/t + F − H
S° = A*ln(t) + B*t + C*t2/2 + D*t3/3 −
E/(2*t2) + G
Cp = heat capacity (J/mol*K)
H° = standard enthalpy (kJ/mol)
S° = standard entropy (J/mol*K)
t = temperature (K) / 1000.
View plot Requires a JavaScript / HTML 5 canvas capable browser.
Temperature (K) | 1000. to 6000. |
---|---|
A | 132.0780 |
B | 0.380912 |
C | 0.583308 |
D | -0.080716 |
E | -0.434898 |
F | -240.0126 |
G | 618.7216 |
H | -199.1584 |
Reference | Chase, 1998 |
Comment | Data last reviewed in June, 1967 |

References

Chase, 1998
Chase, M.W., Jr.,
NIST-JANAF Themochemical Tables, Fourth Edition,
J. Phys. Chem. Ref. Data, Monograph 9, 1998, 1-1951. [all data]
Kaposi, Popovic, et al., 1977
Kaposi, O.; Popovic, A.; Marsel, J.,
Mass spectrometric studies of tungsten bromides and oxybromides,
J. Inorg. Nucl. Chem., 1977, 39, 1809. [all data]