titanium trifluoride
- Formula: F3Ti
- Molecular weight: 104.862
- CAS Registry Number: 13470-08-1

Condensed phase thermochemistry data

Quantity | Value | Units | Method | Reference | Comment |
---|---|---|---|---|---|
ΔfH°solid | -1435.53 | kJ/mol | Review | Chase, 1998 | Data last reviewed in June, 1968 |
Quantity | Value | Units | Method | Reference | Comment |
S°solid | 87.84 | J/mol*K | Review | Chase, 1998 | Data last reviewed in June, 1968 |
Solid Phase Heat Capacity (Shomate Equation)
Cp° = A + B*t + C*t2 + D*t3 +
E/t2
H° − H°298.15= A*t + B*t2/2 +
C*t3/3 + D*t4/4 − E/t + F − H
S° = A*ln(t) + B*t + C*t2/2 + D*t3/3 −
E/(2*t2) + G
Cp = heat capacity (J/mol*K)
H° = standard enthalpy (kJ/mol)
S° = standard entropy (J/mol*K)
t = temperature (K) / 1000.
View plot Requires a JavaScript / HTML 5 canvas capable browser.
Temperature (K) | 298. to 1500. | 1500. to 2000. |
---|---|---|
A | 78.74037 | 104.5494 |
B | 36.10399 | 17.16059 |
C | -10.78903 | -3.805624 |
D | 4.739510 | 0.582894 |
E | 0.295079 | 2.223613 |
F | -1459.542 | -1478.228 |
G | 174.4649 | 189.6787 |
H | -1435.530 | -1435.530 |
Reference | Chase, 1998 | Chase, 1998 |
Comment | Data last reviewed in June, 1968 | Data last reviewed in June, 1968 |

Phase change data

Data compiled by: William E. Acree, Jr., James S. Chickos
Enthalpy of sublimation
ΔsubH (kJ/mol) | Temperature (K) | Reference | Comment |
---|---|---|---|
237.2 ± 1.7 | 810. | Zmbov and Margrave, 1967 | Based on data from 759. to 865. K. |

Gas phase ion energetics data

Data compiled by: Henry M. Rosenstock, Keith Draxl, Bruce W. Steiner, and John T. Herron
Ionization energy determinations
IE (eV) | Method | Reference |
---|---|---|
10.5 ± 0.5 | EI | Zmbov and Margrave, 1967, 2 |
Appearance energy determinations
Ion | AE (eV) | Other Products | Method | Reference | Comment |
---|---|---|---|---|---|
TiF+ | 15.5 | ? | EI | Zmbov and Margrave, 1967, 2 | |
TiF2+ | 14.0 | F | EI | Zmbov and Margrave, 1967, 2 | |
Ti+ | 21.3 | ? | EI | Zmbov and Margrave, 1967, 2 |

Gas phase thermochemistry data

Quantity Value Units Method Reference Comment
Δfgas-1188.67kJ/molReviewChase, 1998Data last reviewed in June, 1968
Quantity Value Units Method Reference Comment
gas,1 bar291.33J/mol*KReviewChase, 1998Data last reviewed in June, 1968

Gas Phase Heat Capacity (Shomate Equation)

Cp° = A + B*t + C*t2 + D*t3 + E/t2
H° − H°298.15= A*t + B*t2/2 + C*t3/3 + D*t4/4 − E/t + F − H
S° = A*ln(t) + B*t + C*t2/2 + D*t3/3 − E/(2*t2) + G
    Cp = heat capacity (J/mol*K)
    H° = standard enthalpy (kJ/mol)
    S° = standard entropy (J/mol*K)
    t = temperature (K) / 1000.

View plot Requires a JavaScript / HTML 5 canvas capable browser.

View table.

Temperature (K) 298. - 6000.
A 84.68960
B 1.128003
C -0.375600
D 0.033208
E -1.773861
F -1219.916
G 383.5230
H -1188.674
ReferenceChase, 1998
Comment Data last reviewed in June, 1968

References

Chase, 1998
Chase, M.W., Jr.,
NIST-JANAF Themochemical Tables, Fourth Edition,
J. Phys. Chem. Ref. Data, Monograph 9, 1998, 1-1951. [all data]
Zmbov and Margrave, 1967
Zmbov, Kiro F.; Margrave, John L.,
Mass spectrometric studies at high temperatures. XVI. Sublimation pressures for titanium(III)fluoride and the stabilities of TiF2(g) and TiF(g),
J. Phys. Chem., 1967, 71, 9, 2893-2895, https://doi.org/10.1021/j100868a021
. [all data]
Zmbov and Margrave, 1967, 2
Zmbov, K.F.; Margrave, J.L.,
Mass spectrometric studies at high temperatures. XVI.Sublimation pressures for TiF.and the stabilities of TiF2(g) and TiF(g),
J. Phys. Chem., 1967, 71, 2893. [all data]