3-Carene
- Formula: C10H16
- Molecular weight: 136.2340
- IUPAC Standard InChIKey: BQOFWKZOCNGFEC-DTWKUNHWSA-N
- CAS Registry Number: 13466-78-9
- Chemical structure:
View 3d structure (requires JavaScript / HTML 5) - Stereoisomers:
- Other names: Bicyclo[4.1.0]hept-3-ene, 3,7,7-trimethyl-; delta-3-Carene; 3,7,7-Trimethylbicyclo[4.1.0]hept-3-ene; δ 3-carene; 3,7,7-Trimethylbicyclo[4.1.0]-3-heptene; 3-Karen; 3-Norcarene, 3,7,7-trimethyl-; 4,7,7-Trimethyl-3-norcarene; Δ-car-3-ene; 3-δ-Carene; Car-3-ene; Carene

Gas phase thermochemistry data

Data compiled by: Hussein Y. Afeefy, Joel F. Liebman, and Stephen E. Stein
Quantity | Value | Units | Method | Reference | Comment |
---|---|---|---|---|---|
ΔfH°gas | 19. ± 4. | kJ/mol | Ccb | Kozina, Aleshina, et al., 1975 |

Condensed phase thermochemistry data

Data compiled by: Hussein Y. Afeefy, Joel F. Liebman, and Stephen E. Stein
Quantity | Value | Units | Method | Reference | Comment |
---|---|---|---|---|---|
ΔfH°liquid | -29.5 ± 1.9 | kJ/mol | Ccb | Kozina, Aleshina, et al., 1975 | |
Quantity | Value | Units | Method | Reference | Comment |
ΔcH°liquid | -6192.2 ± 1.8 | kJ/mol | Ccb | Kozina, Aleshina, et al., 1975 | Corresponding ΔfHºliquid = -29.5 kJ/mol (simple calculation by NIST; no Washburn corrections) |

Phase change data

Data compiled as indicated in comments:
TRC - Thermodynamics Research Center, NIST Boulder Laboratories, Chris Muzny director
BS - Robert L. Brown and Stephen E. Stein
ALS - Hussein Y. Afeefy, Joel F. Liebman, and Stephen E. Stein
DRB - Donald R. Burgess, Jr.
Quantity | Value | Units | Method | Reference | Comment |
---|---|---|---|---|---|
Tboil | 446.5 | K | N/A | Arbusov and Michailov, 1930 | Uncertainty assigned by TRC = 2. K; TRC |
Tboil | 443. | K | N/A | Dupont, 1924 | Uncertainty assigned by TRC = 4. K; TRC |
Tboil | 442. | K | N/A | Simonsen, 1920 | Uncertainty assigned by TRC = 3. K; TRC |
Quantity | Value | Units | Method | Reference | Comment |
ΔvapH° | 48.3 ± 3.1 | kJ/mol | V | Kozina, Aleshina, et al., 1975 | ALS |
ΔvapH° | 48.5 | kJ/mol | N/A | Kozina, Aleshina, et al., 1975 | DRB |
Reduced pressure boiling point
Tboil (K) | Pressure (bar) | Reference | Comment |
---|---|---|---|
441.7 | 0.940 | Aldrich Chemical Company Inc., 1990 | BS |

Gas phase ion energetics data

Data compiled by: Sharon G. Lias, John E. Bartmess, Joel F. Liebman, John L. Holmes, Rhoda D. Levin, and W. Gary Mallard
Ionization energy determinations
IE (eV) | Method | Reference | Comment |
---|---|---|---|
8.4 | PE | Chuiko, Manukov, et al., 1985 | |
8.61 | PE | Chuiko, Manukov, et al., 1985 | Vertical value |

Normal alkane RI, polar column, temperature ramp

Data compiled by: NIST Mass Spectrometry Data Center, William E. Wallace, director

Column type CapillaryCapillaryCapillaryCapillaryCapillary
Active phase Supelcowax-10Supelcowax-10HP-InnowaxSupelcowax-10HP-Innowax
Column length (m) 30.30.30.30.30.
Carrier gas HeliumHeliumNitrogenN2N2
Substrate
Column diameter (mm) 0.200.250.250.320.25
Phase thickness (μm) 0.200.250.520.250.25
Tstart (C) 70.70.35.50.50.
Tend (C) 220.220.205.200.240.
Heat rate (K/min) 3.2.3.1.5.
Initial hold (min)   10.1.1.
Final hold (min) 15. 10. 4.
I 1151.1118.1159.1143.1148.
ReferenceNeves, Rosa, et al., 2010Benites, Moiteiro, et al., 2009Wannes, Mhamdi, et al., 2009Calyecac-cortero, Cibrian-Tovar, et al., 2007Cheraif, Ben Jannet, et al., 2007
Comment MSDC-RI MSDC-RI MSDC-RI MSDC-RI MSDC-RI
Column type CapillaryCapillaryCapillaryCapillaryCapillary
Active phase CP-Wax 52CBTC-FFAPCP-Wax 52CBCarbowaxSupelcowax-10
Column length (m) 30. 60.60.30.
Carrier gas HeHeHeHeHe
Substrate
Column diameter (mm) 0.320.250.320.250.25
Phase thickness (μm) 0.250.250.50.250.25
Tstart (C) 40.60.40.40.40.
Tend (C) 220.220.220.180.250.
Heat rate (K/min) 3.3.4.5.3.
Initial hold (min) 1. 8. 5.
Final hold (min) 2.30.20. 10.
I 1146.1160.1154.1156.1141.
ReferenceHymete, Rohloff, et al., 2007Kurose, Okamura, et al., 2007Povolo, Contarini, et al., 2007Singh, Kumar, et al., 2007Vichi, Riu-Aumatell, et al., 2007
Comment MSDC-RI MSDC-RI MSDC-RI MSDC-RI MSDC-RI
Column type CapillaryCapillaryCapillaryCapillaryCapillary
Active phase InnowaxInnowaxAT-WaxBP-20Supelcowax 10
Column length (m) 30.30.60.50.30.
Carrier gas N2N2He Helium
Substrate
Column diameter (mm) 0.250.250.250.220.20
Phase thickness (μm) 0.250.250.250.250.20
Tstart (C) 50.50.60.60.70.
Tend (C) 280.280.200.220.220.
Heat rate (K/min) 9.9.4.2.3.
Initial hold (min) 3.3.
Final hold (min) 3.3.20.20.15.
I 1130.1147.1147.1149.1152.
ReferenceAbdelwahed, Hayder, et al., 2006Abdelwahed, Hayder, et al., 2006Borges, Rojas, et al., 2006Boti, Yao, et al., 2006Cavaleiro, Pinto, et al., 2006
Comment MSDC-RI MSDC-RI MSDC-RI MSDC-RI MSDC-RI
Column type CapillaryCapillaryCapillaryCapillaryCapillary
Active phase DB-WaxBP-20FFAPSupelcowax-10Supelcowax-10
Column length (m) 60.50.20.30.30.
Carrier gas N2HeHeHeHe
Substrate
Column diameter (mm) 0.250.220.250.250.25
Phase thickness (μm) 0.250.250.250.250.25
Tstart (C) 70.60.90.50.50.
Tend (C) 230.220.250.220.250.
Heat rate (K/min) 2.2.6.4.4.
Initial hold (min) 2.  1.1.
Final hold (min) 20.20. 10.10.
I 1167.1147.1170.1141.1121.
ReferenceChoi, 2006Fanciullino, Tomi, et al., 2006Kitchlu, Bakshi, et al., 2006Wong, Lim, et al., 2006Wong, Sivasothy, et al., 2006
Comment MSDC-RI MSDC-RI MSDC-RI MSDC-RI MSDC-RI
Column type CapillaryCapillaryCapillaryCapillaryCapillary
Active phase InnowaxStabilwaxStabilwaxHP-20MDB-Wax
Column length (m) 50.30.30.50.60.
Carrier gas HeH2 HeliumN2
Substrate
Column diameter (mm) 0.20.320.320.200.25
Phase thickness (μm) 0.50.50.50.200.25
Tstart (C) 60.40.40.70.70.
Tend (C) 250.280.280.180.230.
Heat rate (K/min) 2.6.6.4.2.
Initial hold (min)  5.5.4.2.
Final hold (min) 60.5.5.10.20.
I 1129.1149.1154.1131.1142.
ReferenceBendimerad and Bendiab, 2005Jirovetz, Buchbauer, et al., 2005Jirovetz, Buchbauer, et al., 2005, 2Kulisic, Radonic, et al., 2005Njoroge, Koaze, et al., 2005
Comment MSDC-RI MSDC-RI MSDC-RI MSDC-RI MSDC-RI
Column type CapillaryCapillaryCapillaryCapillaryCapillary
Active phase Stabilwax DACP-Wax 52CBSupelcowax-10Supelcowax-10DB-Wax
Column length (m) 60.30.30.30.30.
Carrier gas  He  He
Substrate
Column diameter (mm) 0.250.320.250.250.25
Phase thickness (μm) 0.50.250.250.250.25
Tstart (C) 40.40.40.40.90.
Tend (C) 180.220.210.220.220.
Heat rate (K/min) 5.4.2.3.7.
Initial hold (min) 5.1.2.5.2.
Final hold (min)   33.10.5.
I 1122.1147.1137.1141.1162.
ReferenceNogueira, Lubachevsky, et al., 2005Rohloff and Bones, 2005Stevanovic, Garneau, et al., 2005Vichi, Riu-Aumatell, et al., 2005Agnihotri, Thappa, et al., 2004
Comment MSDC-RI MSDC-RI MSDC-RI MSDC-RI MSDC-RI
Column type CapillaryCapillaryCapillaryCapillaryCapillary
Active phase RTX-WaxDB-WaxSupelcowax-10Supelcowax-10Supelcowax-10
Column length (m) 60.60.60.50.50.
Carrier gas HeN2HeHeHe
Substrate
Column diameter (mm) 0.220.250.20.20.2
Phase thickness (μm) 0.250.250.20.250.25
Tstart (C) 60.70.60.70.70.
Tend (C) 230.230.200.230.230.
Heat rate (K/min) 2.2.4.2.2.
Initial hold (min)  2.
Final hold (min) 45.20.40.
I 1149.1156.1127.1146.1149.
ReferenceCavalli, Tomi, et al., 2004Choi, 2004Gauvin, Ravaomanarivo, et al., 2004Orav, Stulova, et al., 2004Orav, Stulova, et al., 2004
Comment MSDC-RI MSDC-RI MSDC-RI MSDC-RI MSDC-RI
Column type CapillaryCapillaryCapillaryCapillaryCapillary
Active phase InnowaxTC-WaxDB-WaxHP-WaxDB-Wax
Column length (m) 50.60.60.50.60.
Carrier gas HeHeH2N2N2
Substrate
Column diameter (mm) 0.20.250.320.250.25
Phase thickness (μm) 0.2 0.250.250.25
Tstart (C) 70.80.40.75.70.
Tend (C) 220.240.245.220.230.
Heat rate (K/min) 4.3.1.53.2.
Initial hold (min)    4.
Final hold (min)   20.
I 1169.1162.1138.1144.1162.
ReferencePalá-Paúl, García-Jiménez, et al., 2004Miyazawa, Teranishi, et al., 2003Gancel, Ollé, et al., 2002Priestap, van Baren, et al., 2002Tu, Thanh, et al., 2002
Comment MSDC-RI MSDC-RI MSDC-RI MSDC-RI MSDC-RI
Column type CapillaryCapillaryCapillaryCapillaryCapillary
Active phase BP-20TC-WaxPEG-20MDB-WaxSupelcowax-10
Column length (m) 50.60.50.30.60.
Carrier gas HeHeHeHeHe
Substrate
Column diameter (mm) 0.220.250.20.20.25
Phase thickness (μm) 0.25   0.25
Tstart (C) 60.80.70.50.60.
Tend (C) 230.250.220.180.280.
Heat rate (K/min) 2.4.2.3.4.
Initial hold (min)    8.
Final hold (min) 35.47.
I 1145.1176.1148.1142.1136.
ReferenceLota, de Rocca Serra, et al., 2001Miyazawa, Kurose, et al., 2001Orav and Kann, 2001Franco and Shibamoto, 2000Korány, Mednyánszky, et al., 2000
Comment MSDC-RI MSDC-RI MSDC-RI MSDC-RI MSDC-RI
Column type CapillaryCapillaryCapillaryCapillaryCapillary
Active phase BP-20HP-20MDB-WaxSupelcowax-10Innowax
Column length (m) 25.50.60.30.60.
Carrier gas NitrogenHeNitrogen He
Substrate
Column diameter (mm) 0.500.200.250.250.25
Phase thickness (μm) 0.250.20 0.250.25
Tstart (C) 60.70.40.60.60.
Tend (C) 200.180.200.220.220.
Heat rate (K/min) 5.4.2.4.
Initial hold (min)  4.10. 10.
Final hold (min)
I 1138.1131.1164.1147.1159.
ReferenceMallavarapu, Rao, et al., 2000Mastelic, Milos, et al., 2000Tamura, Boonbumrung, et al., 2000Choo, Wong, et al., 1999Kaya, Baser, et al., 1999
Comment MSDC-RI MSDC-RI MSDC-RI MSDC-RI MSDC-RI
Column type CapillaryCapillaryCapillaryCapillaryCapillary
Active phase Supelcowax-10DB-WaxHP-20MDB-WaxHP-Innowax
Column length (m) 30.60.50.30.60.
Carrier gas HeHeHeN2He
Substrate
Column diameter (mm) 0.250.250.20.250.25
Phase thickness (μm)  0.250.20.250.25
Tstart (C) 60.60.70.45.50.
Tend (C) 240.240.180.220.220.
Heat rate (K/min) 4.4.4.3.5.
Initial hold (min)   4. 5.
Final hold (min)   10.
I 1149.1152.1131.1151.1171.
ReferenceLabuckas, Zygadlo, et al., 1999Ngassoum, Yonkeu, et al., 1999Milso, Mastelic, et al., 1998Mölleken, Sinnwell, et al., 1998Stashenko, Cervantes, et al., 1998
Comment MSDC-RI MSDC-RI MSDC-RI MSDC-RI MSDC-RI
Column type CapillaryCapillaryCapillaryCapillaryCapillary
Active phase DB-WaxPEG-20MPEG-20MCarbowax 20MDB-Wax
Column length (m) 30.50.60.60.60.
Carrier gas N2HeHeHeHe
Substrate
Column diameter (mm) 0.3190.250.320.250.25
Phase thickness (μm) 0.25 0.250.250.25
Tstart (C) 60.70.70.50.50.
Tend (C) 300.250.180.150.230.
Heat rate (K/min) 8.2.2.2.2.
Initial hold (min)   7.10.4.
Final hold (min) 15.  20.
I 1141.1148.1158.1150.1146.
ReferenceMalizia, Molli, et al., 1996Orav, Kailas, et al., 1996Orav, Kuningas, et al., 1995Tirado, Stashenko, et al., 1995Shimoda, Shiratsuchi, et al., 1993
Comment MSDC-RI MSDC-RI MSDC-RI MSDC-RI MSDC-RI
Column type CapillaryCapillaryCapillaryCapillaryPacked
Active phase Carbowax 20MDB-WaxBP-20Carbowax 20MCarbowax 20M
Column length (m) 45.30.25.150.2.
Carrier gas Hydrogen   Hydrogen
Substrate     Gas-Chrom Z (80-100 mesh)
Column diameter (mm) 0.320.320.20.64
Phase thickness (μm) 1.0
Tstart (C) 60.70.70.50.65.
Tend (C) 200.200.180.170.220.
Heat rate (K/min) 2.4.3.1.4.
Initial hold (min) 5.2.5.30.
Final hold (min)
I 1159.1163.1165.1150.1167.
ReferenceKollmannsberger, Nitz, et al., 1992Wyllie, Brophy, et al., 1990MacLeod and Snyder, 1985Buttery and Kamm, 1980Stancher and Pertoldi, 1967
Comment MSDC-RI MSDC-RI MSDC-RI MSDC-RI MSDC-RI

Kovats' RI, non-polar column, custom temperature program

Data compiled by: NIST Mass Spectrometry Data Center, William E. Wallace, director

Column type CapillaryCapillaryCapillaryCapillaryCapillary
Active phase BP-1DB-5BP-1BP-1DB-5
Column length (m) 25.30.25.30.30.
Carrier gas N2HeN2N2H2
Substrate
Column diameter (mm) 0.250.250.250.320.20
Phase thickness (μm) 0.250.250.250.25
Program 60C => 5C/min => 220C(5min) => 3C/min => 245C(5min)35C => 4C/min => 180C => 20C/min => 280C60C => 5C/min => 220C (5min) => 3C/min => 245 C (5min)60 C 5 C/min -> 220 C (5 min) 3 C/min -> 245 C (5 min)not specified
I 1011.1011.1012.1012.1011.
ReferenceDwivedi, Khan, et al., 2004Araújo, Silveira, et al., 2003Khan, Srivastava, et al., 2003Khan, Srivastava, et al., 2002Moreira, Sousa, et al., 2001
Comment MSDC-RI MSDC-RI MSDC-RI MSDC-RI MSDC-RI
Column type CapillaryCapillaryCapillaryCapillaryCapillary
Active phase HP-5AT-5AT-5DB-5BP-1
Column length (m) 30.60.60.30.25.
Carrier gas HeHeHe
Substrate
Column diameter (mm) 0.250.250.250.260.2
Phase thickness (μm) 0.250.250.250.25
Program 50 0C 5 K/min -> 140 0C 2 K/min -> 170 0C60 C 4K/min -> 200 C 10 K/min -> 280 C60 C (1 min) 4 K/min -> 200 C 10 K/min -> 280 Cnot specifiednot specified
I 1013.1010.1017.1011.1005.
ReferenceNovak, Zitterl-Eglseer, et al., 2001Khouri, Usubillaga, et al., 2000Rojas and Usubillaga, 2000Adams, 1998MacLeod, MacLeod, et al., 1988
Comment MSDC-RI MSDC-RI MSDC-RI MSDC-RI MSDC-RI

References

Kozina, Aleshina, et al., 1975
Kozina, M.P.; Aleshina, V.A.; Gal'chenko, G.L.; Buinova, E.F.; Bardyshev, I.I.,
Enthalpies of combustion of 3- and 2-carenes,
Vestsi Akad. Nauk. BSSR, Ser. Khim. Nauk., 1975, 14-17. [all data]
Arbusov and Michailov, 1930
Arbusov, B.; Michailov, B.M.,
J. Prakt. Chem., 1930, 127, 1. [all data]
Dupont, 1924
Dupont, G.,
Ann. Chim. (Paris), 1924, 1, 184-274. [all data]
Simonsen, 1920
Simonsen, J.L.,
J. Chem. Soc., 1920, 117, 570. [all data]
Aldrich Chemical Company Inc., 1990
Aldrich Chemical Company Inc.,
Catalog Handbook of Fine Chemicals, Aldrich Chemical Company, Inc., Milwaukee WI, 1990, 1. [all data]
Chuiko, Manukov, et al., 1985
Chuiko, V.A.; Manukov, E.N.; Chukhov, Y.V.; Timoshenko, M.M.,
An investigation of terpene hydrocarbons of the carane series by photoelectron spectroscopy,
J. Org. Chem. USSR, 1985, 600. [all data]