Hexachlorodisilane
- Formula: Cl6Si2
- Molecular weight: 268.889
- IUPAC Standard InChIKey: LXEXBJXDGVGRAR-UHFFFAOYSA-N
- CAS Registry Number: 13465-77-5
- Chemical structure:
View 3d structure (requires JavaScript / HTML 5) - Other names: Si2Cl6; Disilane, hexachloro-

Phase change data

Antoine Equation Parameters
log10(P) = A − (B / (T + C))
P = vapor pressure (bar)
T = temperature (K)
View plot Requires a JavaScript / HTML 5 canvas capable browser.
Temperature (K) | A | B | C | Reference | Comment |
---|---|---|---|---|---|
277. to 412. | 5.64234 | 2258.602 | -11.798 | Stull, 1947 | Coefficents calculated by NIST from author's data. |

Gas phase ion energetics data

Data compiled as indicated in comments:
LLK - Sharon G. Lias, Rhoda D. Levin, and Sherif A. Kafafi
RDSH - Henry M. Rosenstock, Keith Draxl, Bruce W. Steiner, and John T. Herron
Ionization energy determinations
IE (eV) | Method | Reference | Comment |
---|---|---|---|
11.0 ± 0.3 | EI | Ihle, Wu, et al., 1978 | LLK |
10.4 | PE | Potzinger, Ritter, et al., 1975 | LLK |
10.91 | PE | Khvostenko, Zykov, et al., 1981 | Vertical value; LLK |
Appearance energy determinations
Ion | AE (eV) | Other Products | Method | Reference | Comment |
---|---|---|---|---|---|
Cl3Si+ | 11.4 ± 0.1 | SiCl3 | EI | Potzinger, Ritter, et al., 1975 | LLK |
SiCl3+ | 11.6 ± 0.1 | SiCl3 | EI | Steele and Stone, 1962 | RDSH |

References

Stull, 1947
Stull, Daniel R.,
Vapor Pressure of Pure Substances. Organic and Inorganic Compounds,
Ind. Eng. Chem., 1947, 39, 4, 517-540, https://doi.org/10.1021/ie50448a022
. [all data]
Ihle, Wu, et al., 1978
Ihle, H.R.; Wu, C.H.; Miletic, M.; Zmbov, K.F.,
Mass spectrometric studies of gas species in the systems Si-Cl and Si-Li,
Adv. Mass Spectrom., 1978, 7, 670. [all data]
Potzinger, Ritter, et al., 1975
Potzinger, P.; Ritter, A.; Krause, J.,
Massenspektrometrische Bestimmung von Bindungsenergien in siliciumorganischen Verbindungen,
Z. Naturforsch. A:, 1975, 30, 347. [all data]
Khvostenko, Zykov, et al., 1981
Khvostenko, V.I.; Zykov, B.G.; Yuriev, V.P.; Mironov, V.F.; Kovel'zon, G.I.; Panasenko, A.A.; Sheludyakov, V.D.; Gailyunas, I.A.,
Study of d(π)-p(π) interaction in vinyl- and alkylsilicon-containing compounds by photoelectron spectroscopy,
J. Organomet. Chem., 1981, 218, 155. [all data]
Steele and Stone, 1962
Steele, W.C.; Stone, F.G.A.,
Silicon-silicon bond dissociation energies in disilane and hexachlorodisilane,
J. Am. Chem. Soc., 1962, 84, 3599. [all data]