Trifluorosilane
- Formula: F3HSi
- Molecular weight: 86.0886
- IUPAC Standard InChIKey: WPPVEXTUHHUEIV-UHFFFAOYSA-N
- CAS Registry Number: 13465-71-9
- Chemical structure:
View 3d structure (requires JavaScript / HTML 5) - Permanent link for this species. Use this link for bookmarking this species for future reference.

Gas phase thermochemistry data

Quantity | Value | Units | Method | Reference | Comment |
---|---|---|---|---|---|
ΔfH°gas | -1200.81 | kJ/mol | Review | Chase, 1998 | Data last reviewed in June, 1976 |
Quantity | Value | Units | Method | Reference | Comment |
S°gas,1 bar | 277.26 | J/mol*K | Review | Chase, 1998 | Data last reviewed in June, 1976 |
Gas Phase Heat Capacity (Shomate Equation)
Cp° = A + B*t + C*t2 + D*t3 +
E/t2
H° − H°298.15= A*t + B*t2/2 +
C*t3/3 + D*t4/4 − E/t + F − H
S° = A*ln(t) + B*t + C*t2/2 + D*t3/3 −
E/(2*t2) + G
Cp = heat capacity (J/mol*K)
H° = standard enthalpy (kJ/mol)
S° = standard entropy (J/mol*K)
t = temperature (K) / 1000.
View plot Requires a JavaScript / HTML 5 canvas capable browser.
Temperature (K) | 298. to 1100. | 1100. to 6000. |
---|---|---|
A | 34.58566 | 104.3126 |
B | 148.8157 | 2.062031 |
C | -123.8493 | -0.410743 |
D | 38.20222 | 0.028121 |
E | -0.489151 | -8.895226 |
F | -1218.360 | -1254.710 |
G | 277.1595 | 370.7233 |
H | -1200.808 | -1200.808 |
Reference | Chase, 1998 | Chase, 1998 |
Comment | Data last reviewed in June, 1976 | Data last reviewed in June, 1976 |

Phase change data

Data compiled as indicated in comments:
AC - William E. Acree, Jr., James S. Chickos
Enthalpy of vaporization
ΔvapH (kJ/mol) | Temperature (K) | Reference | Comment |
---|---|---|---|
20.1 | 162. | Emel«65533»us and Maddock, 1944 | Based on data from 156. to 168. K.; AC |
Antoine Equation Parameters
log10(P) = A − (B / (T + C))
P = vapor pressure (bar)
T = temperature (K)
View plot Requires a JavaScript / HTML 5 canvas capable browser.
Temperature (K) | A | B | C | Reference | Comment |
---|---|---|---|---|---|
121. to 178. | 4.4464 | 648.678 | -32.493 | Stull, 1947 | Coefficents calculated by NIST from author's data. |

Gas phase ion energetics data

Data compiled as indicated in comments:
B - John E. Bartmess
LLK - Sharon G. Lias, Rhoda D. Levin, and Sherif A. Kafafi
RDSH - Henry M. Rosenstock, Keith Draxl, Bruce W. Steiner, and John T. Herron
Ionization energy determinations
IE (eV) | Method | Reference | Comment |
---|---|---|---|
11. ± 1. | EI | Farber and Srivastava, 1977 | LLK |
14.0 | PE | Cradock, Ebsworth, et al., 1973 | LLK |
14.48 ± 0.05 | PE | Demuth, 1977 | Vertical value; LLK |
14.48 ± 0.02 | PE | Cradock, Ebsworth, et al., 1973 | Vertical value; LLK |
Appearance energy determinations
Ion | AE (eV) | Other Products | Method | Reference | Comment |
---|---|---|---|---|---|
SiHF2+ | 13.4 ± 0.3 | F | EI | Sharp and Margrave, 1969 | RDSH |
De-protonation reactions
F3Si- + =
By formula: F3Si- + H+ = HF3Si
Quantity | Value | Units | Method | Reference | Comment |
---|---|---|---|---|---|
ΔrH° | 1498. ± 22. | kJ/mol | D-EA | Kawamata, Neigishi, et al., 1996 | gas phase; Vertical Detachment Energy: 2.76±0.05 eV.; B |
Quantity | Value | Units | Method | Reference | Comment |
ΔrG° | 1466. ± 22. | kJ/mol | H-TS | Kawamata, Neigishi, et al., 1996 | gas phase; Vertical Detachment Energy: 2.76±0.05 eV.; B |

References

Chase, 1998
Chase, M.W., Jr.,
NIST-JANAF Themochemical Tables, Fourth Edition,
J. Phys. Chem. Ref. Data, Monograph 9, 1998, 1-1951. [all data]
Emel«65533»us and Maddock, 1944
Emel«65533»us, H.J.; Maddock, A.G.,
77. Derivatives of monosilane. Part III. The fluoromonosilanes,
J. Chem. Soc., 1944, 293, https://doi.org/10.1039/jr9440000293
. [all data]
Stull, 1947
Stull, Daniel R.,
Vapor Pressure of Pure Substances. Organic and Inorganic Compounds,
Ind. Eng. Chem., 1947, 39, 4, 517-540, https://doi.org/10.1021/ie50448a022
. [all data]
Farber and Srivastava, 1977
Farber, M.; Srivastava, R.D.,
Mass spectrometric determination of the heats of formation of the silane fluorides,
Chem. Phys. Lett., 1977, 51, 307. [all data]
Cradock, Ebsworth, et al., 1973
Cradock, S.; Ebsworth, E.A.V.; Whiteford, R.A.,
Photoelectron spectra of some simple fluorosilanes,
J. Chem. Soc. Dalton Trans., 1973, 22, 2401. [all data]
Demuth, 1977
Demuth, R.,
Photoelektronenspektren von einigen Trihalogensilylphosphanen und -arsanen X3SiER2 (X = F, Cl; E = N, P, As; R = H, CH3),
Z. Naturforsch. B:, 1977, 32, 1252. [all data]
Sharp and Margrave, 1969
Sharp, K.G.; Margrave, J.L.,
Silicon-fluorine chemistry. VII. The reaction of silicon difluoride with hydrogen sulfide,
Inorg. Chem., 1969, 8, 2655. [all data]
Kawamata, Neigishi, et al., 1996
Kawamata, H.; Neigishi, Y.; Kishi, R.; Iwata, S.; Nakajima, A.; Kaya, K.,
Photoelectron Spectroscopy of Silicon-Fluorine Binary Cluster Anions (SinFm-),
J. Chem. Phys., 1996, 105, 13, 5369, https://doi.org/10.1063/1.472377
. [all data]