indium tribromide
- Formula: Br3In
- Molecular weight: 354.530
- CAS Registry Number: 13465-09-3

Reaction thermochemistry data

Data compiled by: José A. Martinho Simões
Individual Reactions
(l) + 3
(l) = Br3In (cr) + 3
(g)
By formula: C3H9In (l) + 3Br2 (l) = Br3In (cr) + 3CH3Br (g)
Quantity | Value | Units | Method | Reference | Comment |
---|---|---|---|---|---|
ΔrH° | -159.0 ± 1.0 | kcal/mol | RSC | Clarke and Price, 1968 | Please also see Pedley and Rylance, 1977 and Cox and Pilcher, 1970. |

Gas phase ion energetics data

Data compiled by: Sharon G. Lias, Rhoda D. Levin, and Sherif A. Kafafi
Ionization energy determinations
IE (eV) | Method | Reference | Comment |
---|---|---|---|
10.3 | PE | Barker, Lappert, et al., 1975 | |
10.32 | PE | Dehmer, Berkowitz, et al., 1974 | Vertical value |

References

Clarke and Price, 1968
Clarke, W.D.; Price, S.J.W.,
Can. J. Chem., 1968, 46, 1633. [all data]
Pedley and Rylance, 1977
Pedley, J.B.; Rylance, J.,
Computer Analysed Thermochemical Data: Organic and Organometallic Compounds, University of Sussex, Brigton, 1977. [all data]
Cox and Pilcher, 1970
Cox, J.D.; Pilcher, G.,
Thermochemistry of Organic and Organometallic Compounds
in Academic Press, New York, 1970. [all data]
Barker, Lappert, et al., 1975
Barker, G.K.; Lappert, M.F.; Pedley, J.B.; Sharp, G.J.; Westwood, N.P.C.,
Bonding studies of boron and the group 3-5 elements. Part XV. He(I) photoelectron spectra of monomeric group 3 tri-halide, trimethyl, and mixed halogenomethyl species,
J. Chem. Soc. Dalton Trans., 1975, 1765. [all data]
Dehmer, Berkowitz, et al., 1974
Dehmer, J.L.; Berkowitz, J.; Cusachs, L.C.; Aldrich, H.S.,
Photoelectron spectroscopy of high temperature vapors. V. HeI spectra of GaX3 and InX3 (X = Cl, Br, I),
J. Chem. Phys., 1974, 61, 594. [all data]