Dihydrogen disulfide
- Formula: H2S2
- Molecular weight: 66.146
- IUPAC Standard InChIKey: BWGNESOTFCXPMA-UHFFFAOYSA-N
- CAS Registry Number: 13465-07-1
- Chemical structure:
View 3d structure (requires JavaScript / HTML 5) - Species with the same structure:

Phase change data

Data compiled by: William E. Acree, Jr., James S. Chickos
Enthalpy of vaporization
ΔvapH (kJ/mol) | Temperature (K) | Method | Reference | Comment |
---|---|---|---|---|
34.0 | 271. | N/A | Dykyj, Svoboda, et al., 1999 | Based on data from 256. to 367. K. |
33.8 ± 0.1 | 293. | C | Feh«65533»r and Hitzemann, 1958 |

Reaction thermochemistry data

Data compiled by: John E. Bartmess
Individual Reactions
HS2- + =
Quantity | Value | Units | Method | Reference | Comment |
---|---|---|---|---|---|
ΔrH° | 1447. ± 15. | kJ/mol | D-EA | Entfellner and Boesl, 2009 | gas phase |
ΔrH° | 1448. ± 13. | kJ/mol | G+TS | Ohair, Depuy, et al., 1993 | gas phase |
Quantity | Value | Units | Method | Reference | Comment |
ΔrG° | 1418. ± 15. | kJ/mol | H-TS | Entfellner and Boesl, 2009 | gas phase |
ΔrG° | 1418. ± 13. | kJ/mol | IMRB | Ohair, Depuy, et al., 1993 | gas phase |

Gas phase ion energetics data

Data compiled as indicated in comments:
B - John E. Bartmess
LLK - Sharon G. Lias, Rhoda D. Levin, and Sherif A. Kafafi
Ionization energy determinations
IE (eV) | Method | Reference | Comment |
---|---|---|---|
9.3 | PE | Wagner and Bock, 1974 | LLK |
10.01 | PE | Wagner and Bock, 1974 | Vertical value; LLK |
De-protonation reactions
HS2- + =
Quantity | Value | Units | Method | Reference | Comment |
---|---|---|---|---|---|
ΔrH° | 1447. ± 15. | kJ/mol | D-EA | Entfellner and Boesl, 2009 | gas phase; B |
ΔrH° | 1448. ± 13. | kJ/mol | G+TS | Ohair, Depuy, et al., 1993 | gas phase; B |
Quantity | Value | Units | Method | Reference | Comment |
ΔrG° | 1418. ± 15. | kJ/mol | H-TS | Entfellner and Boesl, 2009 | gas phase; B |
ΔrG° | 1418. ± 13. | kJ/mol | IMRB | Ohair, Depuy, et al., 1993 | gas phase; B |

References

Dykyj, Svoboda, et al., 1999
Dykyj, J.; Svoboda, J.; Wilhoit, R.C.; Frenkel, M.L.; Hall, K.R.,
Vapor Pressure of Chemicals: Part A. Vapor Pressure and Antoine Constants for Hydrocarbons and Sulfur, Selenium, Tellurium and Hydrogen Containing Organic Compounds, Springer, Berlin, 1999, 373. [all data]
Feh«65533»r and Hitzemann, 1958
Feh«65533»r, F.; Hitzemann, G.,
Beitr«65533»ge zur Chemie des Schwefels. 44. Verdampfungsenthalpien, Dampfdrucke, Siedepunkte, kritische Temperaturen und Drucke sowie Troutonsche Konstanten von Sulfanen,
Z. Anorg. Allg. Chem., 1958, 294, 1-2, 50-62, https://doi.org/10.1002/zaac.19582940105
. [all data]
Entfellner and Boesl, 2009
Entfellner, M.; Boesl, U.,
Photodetachment-photoelectron spectroscopy of disulfanide: the ground and first excited electronic state of HS2 and DS2,
Phys. Chem. Chem. Phys., 2009, 11, 15, 2657-2662, https://doi.org/10.1039/b820174a
. [all data]
Ohair, Depuy, et al., 1993
Ohair, R.A.J.; Depuy, C.H.; Bierbaum, V.M.,
Gas-Phase Chemistry and Thermochemistry of the Hydroxysulfide Anion, HOS-,
J. Phys. Chem., 1993, 97, 30, 7955, https://doi.org/10.1021/j100132a026
. [all data]
Wagner and Bock, 1974
Wagner, G.; Bock, H.,
Photoelektronenspektren und molekuleigenschaften, XXVI. Die delokalisation von schwefel-elektronenpaaren in alkylsulfiden und -disulfiden,
Chem. Ber., 1974, 107, 68. [all data]